{"text_format":"3","workbook":"xlsx","n_sheets":8,"sheets":["Служебный","Итог","Задания","База","База выдачи","Форма ввода","Статистика","Хелп"],"not_rendered":{"macros":1,"defined_names":7},"read":"whole","date_system":"1900"}

{"sheet":"Служебный","index":0,"n_rows":36,"n_cols":18,"rows_kept":36}
["№","Номер","Название команды",null,"Эти номера уже использованы","Эти номера остались","Эти номера команд можно использовать","задания","код",null,"Отметки",null,{"$f":"COUNTA(База!B:B)-1","v":178},null,"Время начала игры",null,null,"События"]
[1,2,127,null,{"$f":"IF(ISERROR(SMALL(B:B,A2)),\"\",SMALL(B:B,A2))","v":1},{"$f":"IF(ISERROR(VLOOKUP(A2,B:B,1,0)),A2,\"\")","v":""},{"$f":"IF(ISERROR(SMALL(F:F,A2)),\"\",SMALL(F:F,A2))","v":31},1,"7СН3",{"$nulls":3},{"$f":"COUNTA('База выдачи'!B:B)-1","v":209},null,"00:02:00"]
[2,3,"4x4",null,2,"",32,2,"D1A2",null,"OK",{"$nulls":3},"Длительность"]
[3,14,"Лева&Тигра",null,3,"",33,3,"51FC",null,"XXXX",{"$nulls":3},181,"минут",{"$f":"O4*60","v":10860},"секунд"]
[4,24,"Антилопы ГНУ",null,4,"",34,4,"110Р",{"$nulls":5},"Время окончания игры"]
[5,30,"АРАБЕЛЛА",null,5,"",35,5,"U127",{"$nulls":5},{"$f":"Время_начала_игры+TIME(0,O4,0)","v":"03:03:00"}]
[6,11,"Артур Пирожков",null,6,"","",6,"17WC"]
[7,5,"Атом",null,7,"","",7,"W134"]
[8,13,"Аьоке!",null,8,"","",8,"S33U"]
[9,27,"Всем пыждец",null,9,"","",9,"W112"]
[10,20,"Дети шпионов",null,10,"","","J",110]
[11,9,"Джи 3",null,11,"","","K",111]
[12,7,"ПИОНЕРЫ",null,12,"","","L",112]
[13,8,"Корпорация счастья",null,13,"","","M",113]
[14,16,"Коты",null,14,"","","N",114]
[15,29,"ЛеТим",null,15,"","","O",115]
[16,23,"Мышь ",null,16,"",""]
[17,26,"НеоБастардс",null,17,"",""]
[18,15,"Нефть",null,18,"",""]
[19,21,"Партизаны Германа",null,19,"",""]
[20,null,"Пони ",null,20,"",""]
[21,22,"СанчеЗ&Ко",null,21,"",""]
[22,4,"Страус",null,22,"",""]
[23,10,"Т-34",null,23,"",""]
[24,null,"Такси",null,24,"",""]
[25,28,"Тригада",null,25,"",""]
[26,1,"Трипыши",null,26,"",""]
[27,19,"Турбо-Зиппер",null,27,"",""]
[28,6,"Уан Туз",null,28,"",""]
[29,25,"Черный плащ",null,29,"",""]
[30,12,"Чистые лапки",null,30,"",""]
[31,17,"ЭросоМания",null,"",31,""]
[32,18,"Юнги",null,"",32,""]
[33,{"$nulls":3},"",33,""]
[34,{"$nulls":3},"",34,""]
[35,{"$nulls":3},"",35,""]

{"sheet":"Итог","index":1,"n_rows":36,"n_cols":4,"rows_kept":36}
["Место","Команда","Количество заданий","Время"]
[1,{"$f":"VLOOKUP(Статистика!BE3,Статистика!$A$3:$B$37,2,0)","v":"2-127"},{"$f":"IF(B2=\"\",\"\",VLOOKUP(B2,Статистика!$B$3:$BD$32,49,0))","v":8},{"$f":"IF(B2=\"\",\"\",VLOOKUP(B2,Статистика!$B$3:$BD$32,50,0))","v":"02:51:19.780"}]
[2,{"$f":"VLOOKUP(Статистика!BE4,Статистика!$A$3:$B$37,2,0)","v":"26-НеоБастардс"},{"$f":"IF(B3=\"\",\"\",VLOOKUP(B3,Статистика!$B$3:$BD$32,49,0))","v":8},{"$f":"IF(B3=\"\",\"\",VLOOKUP(B3,Статистика!$B$3:$BD$32,50,0))","v":"03:02:51.270"}]
[3,{"$f":"VLOOKUP(Статистика!BE5,Статистика!$A$3:$B$37,2,0)","v":"9-Джи 3"},{"$f":"IF(B4=\"\",\"\",VLOOKUP(B4,Статистика!$B$3:$BD$32,49,0))","v":7},{"$f":"IF(B4=\"\",\"\",VLOOKUP(B4,Статистика!$B$3:$BD$32,50,0))","v":"02:23:59.360"}]
[4,{"$f":"VLOOKUP(Статистика!BE6,Статистика!$A$3:$B$37,2,0)","v":"17-ЭросоМания"},{"$f":"IF(B5=\"\",\"\",VLOOKUP(B5,Статистика!$B$3:$BD$32,49,0))","v":6},{"$f":"IF(B5=\"\",\"\",VLOOKUP(B5,Статистика!$B$3:$BD$32,50,0))","v":"02:37:18.410"}]
[5,{"$f":"VLOOKUP(Статистика!BE7,Статистика!$A$3:$B$37,2,0)","v":"18-Юнги"},{"$f":"IF(B6=\"\",\"\",VLOOKUP(B6,Статистика!$B$3:$BD$32,49,0))","v":6},{"$f":"IF(B6=\"\",\"\",VLOOKUP(B6,Статистика!$B$3:$BD$32,50,0))","v":"02:40:27.570"}]
[6,{"$f":"VLOOKUP(Статистика!BE8,Статистика!$A$3:$B$37,2,0)","v":"13-Аьоке!"},{"$f":"IF(B7=\"\",\"\",VLOOKUP(B7,Статистика!$B$3:$BD$32,49,0))","v":6},{"$f":"IF(B7=\"\",\"\",VLOOKUP(B7,Статистика!$B$3:$BD$32,50,0))","v":"02:52:39.730"}]
[7,{"$f":"VLOOKUP(Статистика!BE9,Статистика!$A$3:$B$37,2,0)","v":"4-Страус"},{"$f":"IF(B8=\"\",\"\",VLOOKUP(B8,Статистика!$B$3:$BD$32,49,0))","v":6},{"$f":"IF(B8=\"\",\"\",VLOOKUP(B8,Статистика!$B$3:$BD$32,50,0))","v":"02:55:07.310"}]
[8,{"$f":"VLOOKUP(Статистика!BE10,Статистика!$A$3:$B$37,2,0)","v":"25-Черный плащ"},{"$f":"IF(B9=\"\",\"\",VLOOKUP(B9,Статистика!$B$3:$BD$32,49,0))","v":6},{"$f":"IF(B9=\"\",\"\",VLOOKUP(B9,Статистика!$B$3:$BD$32,50,0))","v":"02:55:25.040"}]
[9,{"$f":"VLOOKUP(Статистика!BE11,Статистика!$A$3:$B$37,2,0)","v":"5-Атом"},{"$f":"IF(B10=\"\",\"\",VLOOKUP(B10,Статистика!$B$3:$BD$32,49,0))","v":6},{"$f":"IF(B10=\"\",\"\",VLOOKUP(B10,Статистика!$B$3:$BD$32,50,0))","v":"02:56:24.590"}]
[10,{"$f":"VLOOKUP(Статистика!BE12,Статистика!$A$3:$B$37,2,0)","v":"15-Нефть"},{"$f":"IF(B11=\"\",\"\",VLOOKUP(B11,Статистика!$B$3:$BD$32,49,0))","v":6},{"$f":"IF(B11=\"\",\"\",VLOOKUP(B11,Статистика!$B$3:$BD$32,50,0))","v":"02:57:56.530"}]
[11,{"$f":"VLOOKUP(Статистика!BE13,Статистика!$A$3:$B$37,2,0)","v":"30-АРАБЕЛЛА"},{"$f":"IF(B12=\"\",\"\",VLOOKUP(B12,Статистика!$B$3:$BD$32,49,0))","v":6},{"$f":"IF(B12=\"\",\"\",VLOOKUP(B12,Статистика!$B$3:$BD$32,50,0))","v":"02:59:43.410"}]
[12,{"$f":"VLOOKUP(Статистика!BE14,Статистика!$A$3:$B$37,2,0)","v":"21-Партизаны Германа"},{"$f":"IF(B13=\"\",\"\",VLOOKUP(B13,Статистика!$B$3:$BD$32,49,0))","v":6},{"$f":"IF(B13=\"\",\"\",VLOOKUP(B13,Статистика!$B$3:$BD$32,50,0))","v":"03:00:14.250"}]
[13,{"$f":"VLOOKUP(Статистика!BE15,Статистика!$A$3:$B$37,2,0)","v":"27-Всем пыждец"},{"$f":"IF(B14=\"\",\"\",VLOOKUP(B14,Статистика!$B$3:$BD$32,49,0))","v":6},{"$f":"IF(B14=\"\",\"\",VLOOKUP(B14,Статистика!$B$3:$BD$32,50,0))","v":"03:02:29.460"}]
[14,{"$f":"VLOOKUP(Статистика!BE16,Статистика!$A$3:$B$37,2,0)","v":"22-СанчеЗ&Ко"},{"$f":"IF(B15=\"\",\"\",VLOOKUP(B15,Статистика!$B$3:$BD$32,49,0))","v":5},{"$f":"IF(B15=\"\",\"\",VLOOKUP(B15,Статистика!$B$3:$BD$32,50,0))","v":"01:47:56.470"}]
[15,{"$f":"VLOOKUP(Статистика!BE17,Статистика!$A$3:$B$37,2,0)","v":"8-Корпорация счастья"},{"$f":"IF(B16=\"\",\"\",VLOOKUP(B16,Статистика!$B$3:$BD$32,49,0))","v":5},{"$f":"IF(B16=\"\",\"\",VLOOKUP(B16,Статистика!$B$3:$BD$32,50,0))","v":"02:38:28.780"}]
[16,{"$f":"VLOOKUP(Статистика!BE18,Статистика!$A$3:$B$37,2,0)","v":"24-Антилопы ГНУ"},{"$f":"IF(B17=\"\",\"\",VLOOKUP(B17,Статистика!$B$3:$BD$32,49,0))","v":5},{"$f":"IF(B17=\"\",\"\",VLOOKUP(B17,Статистика!$B$3:$BD$32,50,0))","v":"02:53:29.070"}]
[17,{"$f":"VLOOKUP(Статистика!BE19,Статистика!$A$3:$B$37,2,0)","v":"19-Турбо-Зиппер"},{"$f":"IF(B18=\"\",\"\",VLOOKUP(B18,Статистика!$B$3:$BD$32,49,0))","v":5},{"$f":"IF(B18=\"\",\"\",VLOOKUP(B18,Статистика!$B$3:$BD$32,50,0))","v":"03:00:46.620"}]
[18,{"$f":"VLOOKUP(Статистика!BE20,Статистика!$A$3:$B$37,2,0)","v":"16-Коты"},{"$f":"IF(B19=\"\",\"\",VLOOKUP(B19,Статистика!$B$3:$BD$32,49,0))","v":5},{"$f":"IF(B19=\"\",\"\",VLOOKUP(B19,Статистика!$B$3:$BD$32,50,0))","v":"03:01:05.370"}]
[19,{"$f":"VLOOKUP(Статистика!BE21,Статистика!$A$3:$B$37,2,0)","v":"6-Уан Туз"},{"$f":"IF(B20=\"\",\"\",VLOOKUP(B20,Статистика!$B$3:$BD$32,49,0))","v":5},{"$f":"IF(B20=\"\",\"\",VLOOKUP(B20,Статистика!$B$3:$BD$32,50,0))","v":"03:02:18.680"}]
[20,{"$f":"VLOOKUP(Статистика!BE22,Статистика!$A$3:$B$37,2,0)","v":"12-Чистые лапки"},{"$f":"IF(B21=\"\",\"\",VLOOKUP(B21,Статистика!$B$3:$BD$32,49,0))","v":5},{"$f":"IF(B21=\"\",\"\",VLOOKUP(B21,Статистика!$B$3:$BD$32,50,0))","v":"03:03:16.770"}]
[21,{"$f":"VLOOKUP(Статистика!BE23,Статистика!$A$3:$B$37,2,0)","v":"7-ПИОНЕРЫ"},{"$f":"IF(B22=\"\",\"\",VLOOKUP(B22,Статистика!$B$3:$BD$32,49,0))","v":4},{"$f":"IF(B22=\"\",\"\",VLOOKUP(B22,Статистика!$B$3:$BD$32,50,0))","v":"02:34:54.090"}]
[22,{"$f":"VLOOKUP(Статистика!BE24,Статистика!$A$3:$B$37,2,0)","v":"28-Тригада"},{"$f":"IF(B23=\"\",\"\",VLOOKUP(B23,Статистика!$B$3:$BD$32,49,0))","v":4},{"$f":"IF(B23=\"\",\"\",VLOOKUP(B23,Статистика!$B$3:$BD$32,50,0))","v":"02:37:45.800"}]
[23,{"$f":"VLOOKUP(Статистика!BE25,Статистика!$A$3:$B$37,2,0)","v":"29-ЛеТим"},{"$f":"IF(B24=\"\",\"\",VLOOKUP(B24,Статистика!$B$3:$BD$32,49,0))","v":4},{"$f":"IF(B24=\"\",\"\",VLOOKUP(B24,Статистика!$B$3:$BD$32,50,0))","v":"02:38:11.370"}]
[24,{"$f":"VLOOKUP(Статистика!BE26,Статистика!$A$3:$B$37,2,0)","v":"20-Дети шпионов"},{"$f":"IF(B25=\"\",\"\",VLOOKUP(B25,Статистика!$B$3:$BD$32,49,0))","v":4},{"$f":"IF(B25=\"\",\"\",VLOOKUP(B25,Статистика!$B$3:$BD$32,50,0))","v":"02:39:58.920"}]
[25,{"$f":"VLOOKUP(Статистика!BE27,Статистика!$A$3:$B$37,2,0)","v":"23-Мышь "},{"$f":"IF(B26=\"\",\"\",VLOOKUP(B26,Статистика!$B$3:$BD$32,49,0))","v":4},{"$f":"IF(B26=\"\",\"\",VLOOKUP(B26,Статистика!$B$3:$BD$32,50,0))","v":"02:49:49.140"}]
[26,{"$f":"VLOOKUP(Статистика!BE28,Статистика!$A$3:$B$37,2,0)","v":"11-Артур Пирожков"},{"$f":"IF(B27=\"\",\"\",VLOOKUP(B27,Статистика!$B$3:$BD$32,49,0))","v":4},{"$f":"IF(B27=\"\",\"\",VLOOKUP(B27,Статистика!$B$3:$BD$32,50,0))","v":"02:59:22.990"}]
[27,{"$f":"VLOOKUP(Статистика!BE29,Статистика!$A$3:$B$37,2,0)","v":"10-Т-34"},{"$f":"IF(B28=\"\",\"\",VLOOKUP(B28,Статистика!$B$3:$BD$32,49,0))","v":3},{"$f":"IF(B28=\"\",\"\",VLOOKUP(B28,Статистика!$B$3:$BD$32,50,0))","v":"02:09:27.150"}]
[28,{"$f":"VLOOKUP(Статистика!BE30,Статистика!$A$3:$B$37,2,0)","v":"1-Трипыши"},{"$f":"IF(B29=\"\",\"\",VLOOKUP(B29,Статистика!$B$3:$BD$32,49,0))","v":3},{"$f":"IF(B29=\"\",\"\",VLOOKUP(B29,Статистика!$B$3:$BD$32,50,0))","v":"02:20:10.200"}]
[29,{"$f":"VLOOKUP(Статистика!BE31,Статистика!$A$3:$B$37,2,0)","v":"14-Лева&Тигра"},{"$f":"IF(B30=\"\",\"\",VLOOKUP(B30,Статистика!$B$3:$BD$32,49,0))","v":3},{"$f":"IF(B30=\"\",\"\",VLOOKUP(B30,Статистика!$B$3:$BD$32,50,0))","v":"02:28:11.470"}]
[30,{"$f":"VLOOKUP(Статистика!BE32,Статистика!$A$3:$B$37,2,0)","v":"3-4x4"},{"$f":"IF(B31=\"\",\"\",VLOOKUP(B31,Статистика!$B$3:$BD$32,49,0))","v":3},{"$f":"IF(B31=\"\",\"\",VLOOKUP(B31,Статистика!$B$3:$BD$32,50,0))","v":"02:57:05.240"}]
[31,{"$f":"VLOOKUP(Статистика!BE33,Статистика!$A$3:$B$37,2,0)","v":""},{"$f":"IF(B32=\"\",\"\",VLOOKUP(B32,Статистика!$B$3:$BD$32,49,0))","v":""},{"$f":"IF(B32=\"\",\"\",VLOOKUP(B32,Статистика!$B$3:$BD$32,50,0))","v":""}]
[32,{"$f":"VLOOKUP(Статистика!BE34,Статистика!$A$3:$B$37,2,0)","v":""},{"$f":"IF(B33=\"\",\"\",VLOOKUP(B33,Статистика!$B$3:$BD$32,49,0))","v":""},{"$f":"IF(B33=\"\",\"\",VLOOKUP(B33,Статистика!$B$3:$BD$32,50,0))","v":""}]
[33,{"$f":"VLOOKUP(Статистика!BE35,Статистика!$A$3:$B$37,2,0)","v":""},{"$f":"IF(B34=\"\",\"\",VLOOKUP(B34,Статистика!$B$3:$BD$32,49,0))","v":""},{"$f":"IF(B34=\"\",\"\",VLOOKUP(B34,Статистика!$B$3:$BD$32,50,0))","v":""}]
[34,{"$f":"VLOOKUP(Статистика!BE36,Статистика!$A$3:$B$37,2,0)","v":""},{"$f":"IF(B35=\"\",\"\",VLOOKUP(B35,Статистика!$B$3:$BD$32,49,0))","v":""},{"$f":"IF(B35=\"\",\"\",VLOOKUP(B35,Статистика!$B$3:$BD$32,50,0))","v":""}]
[35,{"$f":"VLOOKUP(Статистика!BE37,Статистика!$A$3:$B$37,2,0)","v":""},{"$f":"IF(B36=\"\",\"\",VLOOKUP(B36,Статистика!$B$3:$BD$32,49,0))","v":""},{"$f":"IF(B36=\"\",\"\",VLOOKUP(B36,Статистика!$B$3:$BD$32,50,0))","v":""}]

{"sheet":"Задания","index":2,"n_rows":36,"n_cols":17,"rows_kept":36}
["№","Команды",1,2,3,4,5,6,7,8,9,10,11,12,13,14,15]
[1,{"$f":"Статистика!B3","v":"1-Трипыши"},1,3,5,2,4,6,8,7,9,"J","K","L","M","N","O"]
[2,{"$f":"Статистика!B4","v":"2-127"},2,4,3,5,6,7,9,8,1,"I","J","K","L","M","N"]
[3,{"$f":"Статистика!B5","v":"3-4x4"},3,5,2,6,9,8,4,1,7,"H","I","J","K","L","M"]
[4,{"$f":"Статистика!B6","v":"4-Страус"},4,6,1,7,8,9,5,3,2,"G","H","I","J","K","L"]
[5,{"$f":"Статистика!B7","v":"5-Атом"},5,2,4,8,1,3,7,9,6,"F","G","H","I","J","K"]
[6,{"$f":"Статистика!B8","v":"6-Уан Туз"},6,1,9,3,7,4,2,5,8,"E","F","G","H","I","J"]
[7,{"$f":"Статистика!B9","v":"7-ПИОНЕРЫ"},7,9,8,1,3,5,6,2,4,"D","E","F","G","H","I"]
[8,{"$f":"Статистика!B10","v":"8-Корпорация счастья"},8,7,6,9,5,2,1,4,3,"C","D","E","F","G","H"]
[9,{"$f":"Статистика!B11","v":"9-Джи 3"},9,8,7,4,2,1,3,6,5,"B","C","D","E","F","G"]
[10,{"$f":"Статистика!B12","v":"10-Т-34"},1,5,3,7,2,9,4,8,6,"A","B","C","D","E","F"]
[11,{"$f":"Статистика!B13","v":"11-Артур Пирожков"},2,4,6,8,1,3,5,7,9,"O","A","B","C","D","E"]
[12,{"$f":"Статистика!B14","v":"12-Чистые лапки"},3,1,8,6,4,5,7,9,2,"N","O","A","B","C","D"]
[13,{"$f":"Статистика!B15","v":"13-Аьоке!"},4,8,5,2,3,7,9,6,1,"M","N","O","A","B","C"]
[14,{"$f":"Статистика!B16","v":"14-Лева&Тигра"},5,7,1,4,9,6,8,2,3,"L","M","N","O","A","B"]
[15,{"$f":"Статистика!B17","v":"15-Нефть"},6,9,4,5,8,2,1,3,7,"K","L","M","N","O","A"]
[16,{"$f":"Статистика!B18","v":"16-Коты"},7,3,9,1,6,8,2,5,4,"J","K","L","M","N","O"]
[17,{"$f":"Статистика!B19","v":"17-ЭросоМания"},8,6,2,9,7,4,3,1,5,"I","J","K","L","M","N"]
[18,{"$f":"Статистика!B20","v":"18-Юнги"},9,2,7,3,5,1,6,4,8,"H","I","J","K","L","M"]
[19,{"$f":"Статистика!B21","v":"19-Турбо-Зиппер"},1,5,2,9,8,3,4,6,7,"G","H","I","J","K","L"]
[20,{"$f":"Статистика!B22","v":"20-Дети шпионов"},2,6,3,8,1,4,5,7,9,"F","G","H","I","J","K"]
[21,{"$f":"Статистика!B23","v":"21-Партизаны Германа"},3,1,8,4,9,7,2,5,6,"E","F","G","H","I","J"]
[22,{"$f":"Статистика!B24","v":"22-СанчеЗ&Ко"},4,7,5,3,2,1,6,9,8,"D","E","F","G","H","I"]
[23,{"$f":"Статистика!B25","v":"23-Мышь "},5,3,4,7,6,8,9,1,2,"C","D","E","F","G","H"]
[24,{"$f":"Статистика!B26","v":"24-Антилопы ГНУ"},6,9,1,2,7,5,8,4,3,"B","C","D","E","F","G"]
[25,{"$f":"Статистика!B27","v":"25-Черный плащ"},7,2,6,5,3,9,1,8,4,"A","B","C","D","E","F"]
[26,{"$f":"Статистика!B28","v":"26-НеоБастардс"},8,4,9,6,5,2,7,3,1,"O","A","B","C","D","E"]
[27,{"$f":"Статистика!B29","v":"27-Всем пыждец"},9,8,7,1,4,6,3,2,5,"N","O","A","B","C","D"]
[28,{"$f":"Статистика!B30","v":"28-Тригада"},1,3,5,2,4,6,8,9,7,"M","N","O","A","B","C"]
[29,{"$f":"Статистика!B31","v":"29-ЛеТим"},2,4,6,8,9,1,3,7,5,"L","M","N","O","A","B"]
[30,{"$f":"Статистика!B32","v":"30-АРАБЕЛЛА"},3,5,7,9,1,2,4,8,6,"K","L","M","N","O","A"]
[31,null,4,2,3,5,8,9,7,6,1,"J","K","L","M","N","O"]
[32,null,5,6,9,3,2,7,1,4,8,"I","J","K","L","M","N"]
[33,null,6,8,2,7,3,5,9,1,4,"H","I","J","K","L","M"]
[34,null,7,9,8,1,6,4,5,3,2,"G","H","I","J","K","L"]
[35,null,8,1,4,6,7,3,2,5,9,"F","G","H","I","J","K"]

{"sheet":"База","index":3,"n_rows":179,"n_cols":7,"rows_kept":179,"hidden":true}
["Код","Команда","Порядковый номер задания","Задание","Отметка","Время отметки","Время выполнения"]
["18-Юнги-1","18-Юнги",1,9,"OK","00:24:13.320","00:22:14.720"]
["27-Всем пыждец-1","27-Всем пыждец",1,9,"OK","00:25:06.620","00:23:08.060"]
["8-Корпорация счастья-1","8-Корпорация счастья",1,8,"OK","00:25:26.230","00:23:27.650"]
["16-Коты-1","16-Коты",1,7,"OK","00:25:41.500","00:23:42.910"]
["25-Черный плащ-1","25-Черный плащ",1,7,"OK","00:26:00.240","00:24:01.640"]
["26-НеоБастардс-1","26-НеоБастардс",1,8,"OK","00:27:58.940","00:26:00.330"]
["9-Джи 3-1","9-Джи 3",1,9,"OK","00:28:16.780","00:26:18.200"]
["15-Нефть-1","15-Нефть",1,6,"OK","00:30:23.050","00:28:24.450"]
["30-АРАБЕЛЛА-1","30-АРАБЕЛЛА",1,3,"OK","00:30:42.910","00:28:44.310"]
["17-ЭросоМания-1","17-ЭросоМания",1,8,"OK","00:32:04.120","00:30:05.510"]
["12-Чистые лапки-1","12-Чистые лапки",1,3,"OK","00:33:45.540","00:31:46.930"]
["3-4x4-1","3-4x4",1,3,"OK","00:34:01.140","00:32:02.540"]
["15-Нефть-2","15-Нефть",2,9,"OK","00:35:52.490","00:05:29.210"]
["2-127-1","2-127",1,2,"OK","00:36:29.420","00:34:30.810"]
["16-Коты-2","16-Коты",2,3,"OK","00:38:06.460","00:12:24.730"]
["22-СанчеЗ&Ко-1","22-СанчеЗ&Ко",1,4,"OK","00:39:37.710","00:37:39.130"]
["29-ЛеТим-1","29-ЛеТим",1,2,"OK","00:42:14.960","00:40:16.350"]
["5-Атом-1","5-Атом",1,5,"XXXX","00:43:06.560","00:41:07.970"]
["27-Всем пыждец-2","27-Всем пыждец",2,8,"OK","00:43:28.350","00:18:21.500"]
["23-Мышь -1","23-Мышь ",1,5,"XXXX","00:43:53.920","00:41:55.330"]
["20-Дети шпионов-1","20-Дети шпионов",1,2,"OK","00:44:09.730","00:42:11.150"]
["8-Корпорация счастья-2","8-Корпорация счастья",2,7,"OK","00:44:49.080","00:19:22.610"]
["11-Артур Пирожков-1","11-Артур Пирожков",1,2,"OK","00:45:38.930","00:43:40.330"]
["26-НеоБастардс-2","26-НеоБастардс",2,4,"OK","00:45:49.130","00:17:49.970"]
["4-Страус-1","4-Страус",1,4,"OK","00:49:48.060","00:47:49.490"]
["24-Антилопы ГНУ-1","24-Антилопы ГНУ",1,6,"XXXX","00:50:19.870","00:48:21.270"]
["2-127-2","2-127",2,4,"OK","00:50:34.560","00:14:04.920"]
["15-Нефть-3","15-Нефть",3,4,"OK","00:51:45.450","00:15:52.690"]
["22-СанчеЗ&Ко-2","22-СанчеЗ&Ко",2,7,"OK","00:53:17.410","00:13:39.430"]
["10-Т-34-1","10-Т-34",1,1,"XXXX","00:54:33.010","00:52:34.410"]
["9-Джи 3-2","9-Джи 3",2,8,"OK","00:54:48.560","00:26:31.560"]
["25-Черный плащ-2","25-Черный плащ",2,2,"OK","00:56:17.470","00:30:16.990"]
["13-Аьоке!-1","13-Аьоке!",1,4,"OK","00:56:26.790","00:54:28.200"]
["2-127-3","2-127",3,3,"OK","00:56:39.200","00:06:04.390"]
["6-Уан Туз-1","6-Уан Туз",1,6,"XXXX","00:58:34.040","00:56:35.480"]
["16-Коты-3","16-Коты",3,9,"OK","00:59:41.230","00:21:34.520"]
["18-Юнги-2","18-Юнги",2,2,"OK","00:59:49.640","00:35:36.070"]
["24-Антилопы ГНУ-2","24-Антилопы ГНУ",2,9,"OK","01:02:53.640","00:12:33.520"]
["15-Нефть-4","15-Нефть",4,5,"OK","01:03:24.240","00:11:38.540"]
["30-АРАБЕЛЛА-2","30-АРАБЕЛЛА",2,5,"OK","01:03:36.220","00:32:53.070"]
["27-Всем пыждец-3","27-Всем пыждец",3,7,"OK","01:03:55.140","00:20:26.550"]
["17-ЭросоМания-2","17-ЭросоМания",2,6,"XXXX","01:04:26.760","00:32:22.410"]
["3-4x4-2","3-4x4",2,5,"OK","01:05:02.970","00:31:01.550"]
["23-Мышь -2","23-Мышь ",2,3,"OK","01:05:28.660","00:21:34.500"]
["5-Атом-2","5-Атом",2,2,"OK","01:06:09.840","00:23:03.140"]
["26-НеоБастардс-3","26-НеоБастардс",3,9,"OK","01:06:53.490","00:21:04.120"]
["29-ЛеТим-2","29-ЛеТим",2,4,"OK","01:07:52.230","00:25:37.050"]
["14-Лева&Тигра-1","14-Лева&Тигра",1,5,"OK","01:08:03.520","01:06:04.940"]
["19-Турбо-Зиппер-1","19-Турбо-Зиппер",1,1,"XXXX","01:10:04.500","01:08:05.920"]
["2-127-4","2-127",4,5,"OK","01:10:24.970","00:13:45.470"]
["22-СанчеЗ&Ко-3","22-СанчеЗ&Ко",3,5,"OK","01:10:44.980","00:17:27.300"]
["10-Т-34-2","10-Т-34",2,5,"OK","01:10:58.550","00:16:25.290"]
["1-Трипыши-1","1-Трипыши",1,1,"XXXX","01:13:59.030","01:12:00.430"]
["30-АРАБЕЛЛА-3","30-АРАБЕЛЛА",3,7,"OK","01:17:17.420","00:13:40.940"]
["11-Артур Пирожков-2","11-Артур Пирожков",2,4,"OK","01:17:46.340","00:32:07.190"]
["13-Аьоке!-2","13-Аьоке!",2,8,"OK","01:19:23.650","00:22:56.590"]
["18-Юнги-3","18-Юнги",3,7,"OK","01:19:54.650","00:20:04.720"]
["26-НеоБастардс-4","26-НеоБастардс",4,6,"OK","01:20:27.670","00:13:33.900"]
["25-Черный плащ-3","25-Черный плащ",3,6,"OK","01:20:38.300","00:24:20.580"]
["14-Лева&Тигра-2","14-Лева&Тигра",2,7,"OK","01:20:49.720","00:12:45.890"]
["12-Чистые лапки-2","12-Чистые лапки",2,1,"XXXX","01:21:28.510","00:47:42.760"]
["9-Джи 3-3","9-Джи 3",3,7,"OK","01:22:04.920","00:27:16.080"]
["5-Атом-3","5-Атом",3,4,"OK","01:22:35.590","00:16:25.360"]
["15-Нефть-5","15-Нефть",5,8,"OK","01:23:57.060","00:20:32.540"]
["21-Партизаны Германа-1","21-Партизаны Германа",1,3,"OK","01:24:44.360","01:22:45.760"]
["23-Мышь -3","23-Мышь ",3,4,"OK","01:26:19.060","00:20:50.120"]
["21-Партизаны Германа-2","21-Партизаны Германа",2,1,"XXXX","01:26:57.640","00:02:13"]
["22-СанчеЗ&Ко-4","22-СанчеЗ&Ко",4,3,"OK","01:29:22.640","00:18:37.390"]
["17-ЭросоМания-3","17-ЭросоМания",3,2,"OK","01:30:27.130","00:26:00.080"]
["20-Дети шпионов-2","20-Дети шпионов",2,6,"XXXX","01:30:55.030","00:46:45.020"]
["8-Корпорация счастья-3","8-Корпорация счастья",3,6,"XXXX","01:31:08.630","00:46:19.290"]
["1-Трипыши-2","1-Трипыши",2,3,"OK","01:32:05.590","00:18:06.270"]
["26-НеоБастардс-5","26-НеоБастардс",5,5,"OK","01:32:32.730","00:12:04.750"]
["4-Страус-2","4-Страус",2,6,"OK","01:36:08.900","00:46:20.580"]
["28-Тригада-1","28-Тригада",1,1,"OK","01:36:24.620","01:34:26.040"]
["9-Джи 3-4","9-Джи 3",4,4,"OK","01:36:43.950","00:14:38.720"]
["18-Юнги-4","18-Юнги",4,3,"OK","01:37:23.050","00:17:28.140"]
["5-Атом-4","5-Атом",4,8,"OK","01:37:42.060","00:15:06.140"]
["24-Антилопы ГНУ-3","24-Антилопы ГНУ",3,1,"XXXX","01:39:25.550","00:36:31.630"]
["10-Т-34-3","10-Т-34",3,3,"OK","01:39:43.740","00:28:44.940"]
["23-Мышь -4","23-Мышь ",4,7,"OK","01:39:57.210","00:13:37.820"]
["2-127-5","2-127",5,6,"OK","01:40:18.140","00:29:52.860"]
["12-Чистые лапки-3","12-Чистые лапки",3,8,"OK","01:40:36.500","00:19:07.680"]
["6-Уан Туз-2","6-Уан Туз",2,1,"XXXX","01:42:13.080","00:43:38.780"]
["20-Дети шпионов-3","20-Дети шпионов",3,3,"OK","01:43:24.760","00:12:29.390"]
["8-Корпорация счастья-4","8-Корпорация счастья",4,9,"OK","01:43:40.380","00:12:31.430"]
["16-Коты-4","16-Коты",4,1,"XXXX","01:45:49.270","00:46:07.780"]
["3-4x4-3","3-4x4",3,2,"XXXX","01:46:37.060","00:41:33.880"]
["17-ЭросоМания-4","17-ЭросоМания",4,9,"OK","01:47:03.600","00:16:36.130"]
["22-СанчеЗ&Ко-5","22-СанчеЗ&Ко",5,2,"OK","01:47:56.470","00:18:33.470"]
["27-Всем пыждец-4","27-Всем пыждец",4,1,"XXXX","01:48:17.220","00:44:21.810"]
["19-Турбо-Зиппер-2","19-Турбо-Зиппер",2,5,"OK","01:48:48.590","00:38:43.800"]
["9-Джи 3-5","9-Джи 3",5,2,"OK","01:49:04.560","00:12:20.250"]
["18-Юнги-5","18-Юнги",5,5,"OK","01:49:14.470","00:11:51.030"]
["25-Черный плащ-4","25-Черный плащ",4,5,"OK","01:49:29.100","00:28:50.500"]
["1-Трипыши-3","1-Трипыши",3,5,"OK","01:49:39.190","00:17:33.300"]
["13-Аьоке!-3","13-Аьоке!",3,5,"OK","01:50:37.370","00:31:13.430"]
["4-Страус-3","4-Страус",3,1,"OK","01:50:54.140","00:14:44.910"]
["28-Тригада-2","28-Тригада",2,3,"OK","01:54:12.710","00:17:47.710"]
["2-127-6","2-127",6,7,"OK","01:55:04.060","00:14:45.610"]
["30-АРАБЕЛЛА-4","30-АРАБЕЛЛА",4,9,"OK","01:55:25.220","00:38:07.500"]
["27-Всем пыждец-5","27-Всем пыждец",5,4,"OK","01:58:01.800","00:09:44.200"]
["8-Корпорация счастья-5","8-Корпорация счастья",5,5,"OK","01:59:13.270","00:15:32.540"]
["21-Партизаны Германа-3","21-Партизаны Германа",3,8,"OK","01:59:36.190","00:32:38.220"]
["24-Антилопы ГНУ-4","24-Антилопы ГНУ",4,2,"OK","01:59:54.710","00:20:28.820"]
["29-ЛеТим-3","29-ЛеТим",3,6,"XXXX","02:01:08.310","00:53:15.820"]
["17-ЭросоМания-5","17-ЭросоМания",5,7,"OK","02:02:10.440","00:15:06.500"]
["6-Уан Туз-3","6-Уан Туз",3,9,"OK","02:05:10.120","00:22:56.680"]
["15-Нефть-6","15-Нефть",6,2,"XXXX","02:06:09.580","00:42:12.290"]
["19-Турбо-Зиппер-3","19-Турбо-Зиппер",3,2,"OK","02:06:32.660","00:17:43.700"]
["9-Джи 3-6","9-Джи 3",6,1,"OK","02:06:46.330","00:17:41.400"]
["21-Партизаны Германа-4","21-Партизаны Германа",4,4,"OK","02:08:54.730","00:09:18.150"]
["20-Дети шпионов-4","20-Дети шпионов",4,8,"OK","02:09:06.400","00:25:41.310"]
["21-Партизаны Германа-5","21-Партизаны Германа",5,9,"OK","02:09:14.860","00:00:19.720"]
["10-Т-34-4","10-Т-34",4,7,"OK","02:09:27.150","00:29:43.020"]
["4-Страус-4","4-Страус",4,7,"OK","02:09:35.530","00:18:41"]
["25-Черный плащ-5","25-Черный плащ",5,3,"OK","02:09:50.740","00:20:21.250"]
["28-Тригада-3","28-Тригада",3,5,"OK","02:10:49","00:16:35.950"]
["7-ПИОНЕРЫ-1","7-ПИОНЕРЫ",1,7,"OK","02:12:34.680","02:10:36.100"]
["7-ПИОНЕРЫ-2","7-ПИОНЕРЫ",2,9,"OK","02:13:01.450","00:00:26.350"]
["7-ПИОНЕРЫ-4","7-ПИОНЕРЫ",4,1,"OK","02:13:16.780","00:00:14.950"]
["2-127-7","2-127",7,9,"OK","02:14:40.480","00:19:36.030"]
["29-ЛеТим-4","29-ЛеТим",4,8,"OK","02:15:00.190","00:13:51.510"]
["5-Атом-5","5-Атом",5,1,"XXXX","02:15:20.930","00:37:38.530"]
["24-Антилопы ГНУ-5","24-Антилопы ГНУ",5,7,"OK","02:17:27.830","00:17:32.770"]
["13-Аьоке!-4","13-Аьоке!",4,2,"OK","02:17:59.280","00:27:21.520"]
["1-Трипыши-4","1-Трипыши",4,2,"OK","02:20:10.200","00:30:30.580"]
["17-ЭросоМания-6","17-ЭросоМания",6,4,"OK","02:20:21.240","00:18:10.410"]
["6-Уан Туз-4","6-Уан Туз",4,3,"OK","02:20:40.800","00:15:30.290"]
["12-Чистые лапки-4","12-Чистые лапки",4,6,"XXXX","02:21:22.100","00:40:45.290"]
["9-Джи 3-7","9-Джи 3",7,3,"OK","02:23:59.360","00:17:12.630"]
["22-СанчеЗ&Ко-6","22-СанчеЗ&Ко",6,1,"XXXX","02:26:27.370","00:38:30.560"]
["5-Атом-6","5-Атом",6,3,"OK","02:26:37.560","00:11:16.220"]
["14-Лева&Тигра-3","14-Лева&Тигра",3,1,"OK","02:28:11.470","01:07:21.460"]
["3-4x4-4","3-4x4",4,6,"XXXX","02:29:35.460","00:42:58.040"]
["23-Мышь -5","23-Мышь ",5,6,"XXXX","02:30:24.490","00:50:26.960"]
["13-Аьоке!-5","13-Аьоке!",5,3,"OK","02:30:45.230","00:12:45.530"]
["21-Партизаны Германа-6","21-Партизаны Германа",6,7,"OK","02:31:09.770","00:21:54.510"]
["26-НеоБастардс-6","26-НеоБастардс",6,2,"OK","02:31:19.330","00:58:46.270"]
["24-Антилопы ГНУ-6","24-Антилопы ГНУ",6,5,"OK","02:31:36.910","00:14:08.620"]
["4-Страус-5","4-Страус",5,8,"OK","02:33:47.750","00:24:11.830"]
["7-ПИОНЕРЫ-3","7-ПИОНЕРЫ",3,8,"OK","02:34:54.090","00:21:36.960"]
["17-ЭросоМания-7","17-ЭросоМания",7,3,"OK","02:37:18.410","00:16:56.800"]
["12-Чистые лапки-5","12-Чистые лапки",5,4,"OK","02:37:33.630","00:16:11.080"]
["28-Тригада-4","28-Тригада",4,2,"OK","02:37:45.800","00:26:56.430"]
["19-Турбо-Зиппер-4","19-Турбо-Зиппер",4,9,"OK","02:38:01.390","00:31:28.330"]
["29-ЛеТим-5","29-ЛеТим",5,9,"OK","02:38:11.370","00:23:10.750"]
["8-Корпорация счастья-6","8-Корпорация счастья",6,2,"OK","02:38:28.780","00:39:15.130"]
["20-Дети шпионов-5","20-Дети шпионов",5,1,"OK","02:39:58.920","00:30:52.140"]
["6-Уан Туз-5","6-Уан Туз",5,7,"OK","02:40:13.490","00:19:32.260"]
["18-Юнги-6","18-Юнги",6,1,"OK","02:40:27.570","00:51:12.750"]
["5-Атом-7","5-Атом",7,7,"OK","02:44:47.890","00:18:09.900"]
["27-Всем пыждец-6","27-Всем пыждец",6,6,"OK","02:45:12.350","00:47:10.210"]
["11-Артур Пирожков-3","11-Артур Пирожков",3,6,"OK","02:45:24.270","01:27:37.610"]
["16-Коты-5","16-Коты",5,6,"OK","02:45:36.740","00:59:47.110"]
["19-Турбо-Зиппер-5","19-Турбо-Зиппер",5,8,"OK","02:46:06.580","00:08:04.740"]
["26-НеоБастардс-7","26-НеоБастардс",7,7,"OK","02:47:02.330","00:15:42.570"]
["30-АРАБЕЛЛА-5","30-АРАБЕЛЛА",5,1,"OK","02:47:12.380","00:51:46.780"]
["23-Мышь -6","23-Мышь ",6,8,"OK","02:49:49.140","00:19:24.230"]
["2-127-8","2-127",8,8,"OK","02:51:19.780","00:36:38.910"]
["13-Аьоке!-6","13-Аьоке!",6,7,"OK","02:52:39.730","00:21:54.100"]
["12-Чистые лапки-6","12-Чистые лапки",6,5,"OK","02:52:56.950","00:15:22.890"]
["24-Антилопы ГНУ-7","24-Антилопы ГНУ",7,8,"OK","02:53:29.070","00:21:51.730"]
["6-Уан Туз-6","6-Уан Туз",6,4,"OK","02:54:57.520","00:14:43.620"]
["4-Страус-6","4-Страус",6,9,"OK","02:55:07.310","00:21:19.110"]
["25-Черный плащ-6","25-Черный плащ",6,9,"OK","02:55:25.040","00:45:33.900"]
["5-Атом-8","5-Атом",8,9,"OK","02:56:24.590","00:11:36.240"]
["3-4x4-5","3-4x4",5,9,"OK","02:57:05.240","00:27:29.370"]
["15-Нефть-7","15-Нефть",7,1,"OK","02:57:56.530","00:51:46.480"]
["11-Артур Пирожков-4","11-Артур Пирожков",4,8,"OK","02:59:22.990","00:13:58.270"]
["30-АРАБЕЛЛА-6","30-АРАБЕЛЛА",6,2,"OK","02:59:43.410","00:12:30.590"]
["21-Партизаны Германа-7","21-Партизаны Германа",7,2,"OK","03:00:14.250","00:29:04.070"]
["19-Турбо-Зиппер-6","19-Турбо-Зиппер",6,3,"OK","03:00:46.620","00:14:39.590"]
["16-Коты-6","16-Коты",6,8,"OK","03:01:05.370","00:15:28.190"]
["6-Уан Туз-7","6-Уан Туз",7,2,"OK","03:02:18.680","00:07:20.640"]
["27-Всем пыждец-7","27-Всем пыждец",7,3,"OK","03:02:29.460","00:17:16.650"]
["26-НеоБастардс-8","26-НеоБастардс",8,3,"OK","03:02:51.270","00:15:48.500"]
["12-Чистые лапки-7","12-Чистые лапки",7,7,"OK","03:03:16.770","00:10:19.370"]

{"sheet":"База выдачи","index":4,"n_rows":210,"n_cols":6,"rows_kept":210,"hidden":true}
["Код","Команда","Порядковый номер задания","Задание","Отметка","Время отметки"]
["1-Трипыши-1","1-Трипыши",1,1,"ST","00:02:00"]
["2-127-1","2-127",1,2,"ST","00:02:00"]
["3-4x4-1","3-4x4",1,3,"ST","00:02:00"]
["4-Страус-1","4-Страус",1,4,"ST","00:02:00"]
["5-Атом-1","5-Атом",1,5,"ST","00:02:00"]
["6-Уан Туз-1","6-Уан Туз",1,6,"ST","00:02:00"]
["7-ПИОНЕРЫ-1","7-ПИОНЕРЫ",1,7,"ST","00:02:00"]
["8-Корпорация счастья-1","8-Корпорация счастья",1,8,"ST","00:02:00"]
["9-Джи 3-1","9-Джи 3",1,9,"ST","00:02:00"]
["10-Т-34-1","10-Т-34",1,1,"ST","00:02:00"]
["11-Артур Пирожков-1","11-Артур Пирожков",1,2,"ST","00:02:00"]
["12-Чистые лапки-1","12-Чистые лапки",1,3,"ST","00:02:00"]
["13-Аьоке!-1","13-Аьоке!",1,4,"ST","00:02:00"]
["14-Лева&Тигра-1","14-Лева&Тигра",1,5,"ST","00:02:00"]
["15-Нефть-1","15-Нефть",1,6,"ST","00:02:00"]
["16-Коты-1","16-Коты",1,7,"ST","00:02:00"]
["17-ЭросоМания-1","17-ЭросоМания",1,8,"ST","00:02:00"]
["18-Юнги-1","18-Юнги",1,9,"ST","00:02:00"]
["19-Турбо-Зиппер-1","19-Турбо-Зиппер",1,1,"ST","00:02:00"]
["20-Дети шпионов-1","20-Дети шпионов",1,2,"ST","00:02:00"]
["21-Партизаны Германа-1","21-Партизаны Германа",1,3,"ST","00:02:00"]
["22-СанчеЗ&Ко-1","22-СанчеЗ&Ко",1,4,"ST","00:02:00"]
["23-Мышь -1","23-Мышь ",1,5,"ST","00:02:00"]
["24-Антилопы ГНУ-1","24-Антилопы ГНУ",1,6,"ST","00:02:00"]
["25-Черный плащ-1","25-Черный плащ",1,7,"ST","00:02:00"]
["26-НеоБастардс-1","26-НеоБастардс",1,8,"ST","00:02:00"]
["27-Всем пыждец-1","27-Всем пыждец",1,9,"ST","00:02:00"]
["28-Тригада-1","28-Тригада",1,1,"ST","00:02:00"]
["29-ЛеТим-1","29-ЛеТим",1,2,"ST","00:02:00"]
["30-АРАБЕЛЛА-1","30-АРАБЕЛЛА",1,3,"ST","00:02:00"]
["18-Юнги-2","18-Юнги",2,2,"ST","00:24:14.980"]
["27-Всем пыждец-2","27-Всем пыждец",2,8,"ST","00:25:08.260"]
["8-Корпорация счастья-2","8-Корпорация счастья",2,7,"ST","00:25:27.880"]
["16-Коты-2","16-Коты",2,3,"ST","00:25:43.140"]
["25-Черный плащ-2","25-Черный плащ",2,2,"ST","00:26:01.880"]
["26-НеоБастардс-2","26-НеоБастардс",2,4,"ST","00:28:00.560"]
["9-Джи 3-2","9-Джи 3",2,8,"ST","00:28:18.440"]
["15-Нефть-2","15-Нефть",2,9,"ST","00:30:24.690"]
["30-АРАБЕЛЛА-2","30-АРАБЕЛЛА",2,5,"ST","00:30:44.550"]
["17-ЭросоМания-2","17-ЭросоМания",2,6,"ST","00:32:05.750"]
["12-Чистые лапки-2","12-Чистые лапки",2,1,"ST","00:33:47.160"]
["3-4x4-2","3-4x4",2,5,"ST","00:34:02.790"]
["15-Нефть-3","15-Нефть",3,4,"ST","00:35:54.150"]
["2-127-2","2-127",2,4,"ST","00:36:31.050"]
["16-Коты-3","16-Коты",3,9,"ST","00:38:08.120"]
["22-СанчеЗ&Ко-2","22-СанчеЗ&Ко",2,7,"ST","00:39:39.380"]
["29-ЛеТим-2","29-ЛеТим",2,4,"ST","00:42:16.580"]
["5-Атом-2","5-Атом",2,2,"ST","00:43:08.200"]
["27-Всем пыждец-3","27-Всем пыждец",3,7,"ST","00:43:30.010"]
["23-Мышь -2","23-Мышь ",2,3,"ST","00:43:55.580"]
["20-Дети шпионов-2","20-Дети шпионов",2,6,"ST","00:44:11.410"]
["8-Корпорация счастья-3","8-Корпорация счастья",3,6,"ST","00:44:50.740"]
["11-Артур Пирожков-2","11-Артур Пирожков",2,4,"ST","00:45:40.600"]
["26-НеоБастардс-3","26-НеоБастардс",3,9,"ST","00:45:50.780"]
["4-Страус-2","4-Страус",2,6,"ST","00:49:49.740"]
["24-Антилопы ГНУ-2","24-Антилопы ГНУ",2,9,"ST","00:50:21.540"]
["2-127-3","2-127",3,3,"ST","00:50:36.230"]
["15-Нефть-4","15-Нефть",4,5,"ST","00:51:47.100"]
["22-СанчеЗ&Ко-3","22-СанчеЗ&Ко",3,5,"ST","00:53:19.100"]
["10-Т-34-2","10-Т-34",2,5,"ST","00:54:34.680"]
["9-Джи 3-3","9-Джи 3",3,7,"ST","00:54:50.260"]
["25-Черный плащ-3","25-Черный плащ",3,6,"ST","00:56:19.140"]
["13-Аьоке!-2","13-Аьоке!",2,8,"ST","00:56:28.460"]
["2-127-4","2-127",4,5,"ST","00:56:40.900"]
["6-Уан Туз-2","6-Уан Туз",2,1,"ST","00:58:35.740"]
["16-Коты-4","16-Коты",4,1,"ST","00:59:42.920"]
["18-Юнги-3","18-Юнги",3,7,"ST","00:59:51.330"]
["24-Антилопы ГНУ-3","24-Антилопы ГНУ",3,1,"ST","01:02:55.340"]
["15-Нефть-5","15-Нефть",5,8,"ST","01:03:25.940"]
["30-АРАБЕЛЛА-3","30-АРАБЕЛЛА",3,7,"ST","01:03:37.900"]
["27-Всем пыждец-4","27-Всем пыждец",4,1,"ST","01:03:56.840"]
["17-ЭросоМания-3","17-ЭросоМания",3,2,"ST","01:04:28.460"]
["3-4x4-3","3-4x4",3,2,"ST","01:05:04.620"]
["23-Мышь -3","23-Мышь ",3,4,"ST","01:05:30.360"]
["5-Атом-3","5-Атом",3,4,"ST","01:06:11.650"]
["26-НеоБастардс-4","26-НеоБастардс",4,6,"ST","01:06:55.180"]
["29-ЛеТим-3","29-ЛеТим",3,6,"ST","01:07:53.910"]
["14-Лева&Тигра-2","14-Лева&Тигра",2,7,"ST","01:08:05.250"]
["19-Турбо-Зиппер-2","19-Турбо-Зиппер",2,5,"ST","01:10:06.220"]
["2-127-5","2-127",5,6,"ST","01:10:26.680"]
["22-СанчеЗ&Ко-4","22-СанчеЗ&Ко",4,3,"ST","01:10:46.700"]
["10-Т-34-3","10-Т-34",3,3,"ST","01:11:00.270"]
["1-Трипыши-2","1-Трипыши",2,3,"ST","01:14:00.750"]
["30-АРАБЕЛЛА-4","30-АРАБЕЛЛА",4,9,"ST","01:17:19.150"]
["11-Артур Пирожков-3","11-Артур Пирожков",3,6,"ST","01:17:48.100"]
["13-Аьоке!-3","13-Аьоке!",3,5,"ST","01:19:25.370"]
["18-Юнги-4","18-Юнги",4,3,"ST","01:19:56.360"]
["26-НеоБастардс-5","26-НеоБастардс",5,5,"ST","01:20:29.400"]
["25-Черный плащ-4","25-Черный плащ",4,5,"ST","01:20:40.040"]
["14-Лева&Тигра-3","14-Лева&Тигра",3,1,"ST","01:20:51.450"]
["12-Чистые лапки-3","12-Чистые лапки",3,8,"ST","01:21:30.240"]
["9-Джи 3-4","9-Джи 3",4,4,"ST","01:22:06.670"]
["5-Атом-4","5-Атом",4,8,"ST","01:22:37.340"]
["15-Нефть-6","15-Нефть",6,2,"ST","01:23:58.800"]
["21-Партизаны Германа-2","21-Партизаны Германа",2,1,"ST","01:24:46.090"]
["23-Мышь -4","23-Мышь ",4,7,"ST","01:26:20.790"]
["21-Партизаны Германа-3","21-Партизаны Германа",3,8,"ST","01:26:59.420"]
["22-СанчеЗ&Ко-5","22-СанчеЗ&Ко",5,2,"ST","01:29:24.420"]
["17-ЭросоМания-4","17-ЭросоМания",4,9,"ST","01:30:28.870"]
["20-Дети шпионов-3","20-Дети шпионов",3,3,"ST","01:30:56.760"]
["8-Корпорация счастья-4","8-Корпорация счастья",4,9,"ST","01:31:10.380"]
["1-Трипыши-3","1-Трипыши",3,5,"ST","01:32:07.360"]
["26-НеоБастардс-6","26-НеоБастардс",6,2,"ST","01:32:34.490"]
["4-Страус-3","4-Страус",3,1,"ST","01:36:10.660"]
["28-Тригада-2","28-Тригада",2,3,"ST","01:36:26.390"]
["9-Джи 3-5","9-Джи 3",5,2,"ST","01:36:45.730"]
["18-Юнги-5","18-Юнги",5,5,"ST","01:37:24.860"]
["5-Атом-5","5-Атом",5,1,"ST","01:37:43.830"]
["24-Антилопы ГНУ-4","24-Антилопы ГНУ",4,2,"ST","01:39:27.320"]
["10-Т-34-4","10-Т-34",4,7,"ST","01:39:45.570"]
["23-Мышь -5","23-Мышь ",5,6,"ST","01:39:58.970"]
["2-127-6","2-127",6,7,"ST","01:40:19.890"]
["12-Чистые лапки-4","12-Чистые лапки",4,6,"ST","01:40:38.260"]
["6-Уан Туз-3","6-Уан Туз",3,9,"ST","01:42:14.880"]
["20-Дети шпионов-4","20-Дети шпионов",4,8,"ST","01:43:26.530"]
["8-Корпорация счастья-5","8-Корпорация счастья",5,5,"ST","01:43:42.170"]
["16-Коты-5","16-Коты",5,6,"ST","01:45:51.060"]
["3-4x4-4","3-4x4",4,6,"ST","01:46:38.860"]
["17-ЭросоМания-5","17-ЭросоМания",5,7,"ST","01:47:05.380"]
["22-СанчеЗ&Ко-6","22-СанчеЗ&Ко",6,1,"ST","01:47:58.250"]
["27-Всем пыждец-5","27-Всем пыждец",5,4,"ST","01:48:19.010"]
["19-Турбо-Зиппер-3","19-Турбо-Зиппер",3,2,"ST","01:48:50.400"]
["9-Джи 3-6","9-Джи 3",6,1,"ST","01:49:06.360"]
["18-Юнги-6","18-Юнги",6,1,"ST","01:49:16.260"]
["25-Черный плащ-5","25-Черный плащ",5,3,"ST","01:49:30.910"]
["1-Трипыши-4","1-Трипыши",4,2,"ST","01:49:41.050"]
["13-Аьоке!-4","13-Аьоке!",4,2,"ST","01:50:39.180"]
["4-Страус-4","4-Страус",4,7,"ST","01:50:55.960"]
["28-Тригада-3","28-Тригада",3,5,"ST","01:54:14.490"]
["2-127-7","2-127",7,9,"ST","01:55:05.870"]
["30-АРАБЕЛЛА-5","30-АРАБЕЛЛА",5,1,"ST","01:55:27.030"]
["27-Всем пыждец-6","27-Всем пыждец",6,6,"ST","01:58:03.590"]
["8-Корпорация счастья-6","8-Корпорация счастья",6,2,"ST","01:59:15.100"]
["21-Партизаны Германа-4","21-Партизаны Германа",4,4,"ST","01:59:38.030"]
["24-Антилопы ГНУ-5","24-Антилопы ГНУ",5,7,"ST","01:59:56.530"]
["29-ЛеТим-4","29-ЛеТим",4,8,"ST","02:01:10.120"]
["17-ЭросоМания-6","17-ЭросоМания",6,4,"ST","02:02:12.270"]
["6-Уан Туз-4","6-Уан Туз",4,3,"ST","02:05:11.950"]
["15-Нефть-7","15-Нефть",7,1,"ST","02:06:11.510"]
["19-Турбо-Зиппер-4","19-Турбо-Зиппер",4,9,"ST","02:06:34.490"]
["9-Джи 3-7","9-Джи 3",7,3,"ST","02:06:48.170"]
["21-Партизаны Германа-5","21-Партизаны Германа",5,9,"ST","02:08:56.590"]
["20-Дети шпионов-5","20-Дети шпионов",5,1,"ST","02:09:08.230"]
["21-Партизаны Германа-6","21-Партизаны Германа",6,7,"ST","02:09:16.710"]
["10-Т-34-5","10-Т-34",5,2,"ST","02:09:28.980"]
["4-Страус-5","4-Страус",5,8,"ST","02:09:37.370"]
["25-Черный плащ-6","25-Черный плащ",6,9,"ST","02:09:52.580"]
["28-Тригада-4","28-Тригада",4,2,"ST","02:10:50.840"]
["7-ПИОНЕРЫ-2","7-ПИОНЕРЫ",2,9,"ST","02:12:36.520"]
["7-ПИОНЕРЫ-4","7-ПИОНЕРЫ",4,1,"ST","02:13:03.270"]
["7-ПИОНЕРЫ-3","7-ПИОНЕРЫ",3,8,"ST","02:13:18.620"]
["2-127-8","2-127",8,8,"ST","02:14:42.300"]
["29-ЛеТим-5","29-ЛеТим",5,9,"ST","02:15:02.040"]
["5-Атом-6","5-Атом",6,3,"ST","02:15:22.780"]
["24-Антилопы ГНУ-6","24-Антилопы ГНУ",6,5,"ST","02:17:29.720"]
["13-Аьоке!-5","13-Аьоке!",5,3,"ST","02:18:01.120"]
["1-Трипыши-5","1-Трипыши",5,4,"ST","02:20:12.050"]
["17-ЭросоМания-7","17-ЭросоМания",7,3,"ST","02:20:23.080"]
["6-Уан Туз-5","6-Уан Туз",5,7,"ST","02:20:42.660"]
["12-Чистые лапки-5","12-Чистые лапки",5,4,"ST","02:21:23.970"]
["9-Джи 3-8","9-Джи 3",8,6,"ST","02:24:01.220"]
["22-СанчеЗ&Ко-7","22-СанчеЗ&Ко",7,6,"ST","02:26:29.250"]
["5-Атом-7","5-Атом",7,7,"ST","02:26:39.430"]
["14-Лева&Тигра-4","14-Лева&Тигра",4,4,"ST","02:28:13.350"]
["3-4x4-5","3-4x4",5,9,"ST","02:29:37.320"]
["23-Мышь -6","23-Мышь ",6,8,"ST","02:30:26.350"]
["13-Аьоке!-6","13-Аьоке!",6,7,"ST","02:30:47.080"]
["21-Партизаны Германа-7","21-Партизаны Германа",7,2,"ST","02:31:11.650"]
["26-НеоБастардс-7","26-НеоБастардс",7,7,"ST","02:31:21.200"]
["24-Антилопы ГНУ-7","24-Антилопы ГНУ",7,8,"ST","02:31:38.780"]
["4-Страус-6","4-Страус",6,9,"ST","02:33:49.630"]
["7-ПИОНЕРЫ-5","7-ПИОНЕРЫ",5,3,"ST","02:34:56.010"]
["17-ЭросоМания-8","17-ЭросоМания",8,1,"ST","02:37:20.310"]
["12-Чистые лапки-6","12-Чистые лапки",6,5,"ST","02:37:35.510"]
["28-Тригада-5","28-Тригада",5,4,"ST","02:37:47.720"]
["19-Турбо-Зиппер-5","19-Турбо-Зиппер",5,8,"ST","02:38:03.270"]
["29-ЛеТим-6","29-ЛеТим",6,1,"ST","02:38:13.240"]
["8-Корпорация счастья-7","8-Корпорация счастья",7,1,"ST","02:38:30.670"]
["20-Дети шпионов-6","20-Дети шпионов",6,4,"ST","02:40:00.820"]
["6-Уан Туз-6","6-Уан Туз",6,4,"ST","02:40:15.360"]
["18-Юнги-7","18-Юнги",7,6,"ST","02:40:29.460"]
["5-Атом-8","5-Атом",8,9,"ST","02:44:49.780"]
["27-Всем пыждец-7","27-Всем пыждец",7,3,"ST","02:45:14.240"]
["11-Артур Пирожков-4","11-Артур Пирожков",4,8,"ST","02:45:26.190"]
["16-Коты-6","16-Коты",6,8,"ST","02:45:38.620"]
["19-Турбо-Зиппер-6","19-Турбо-Зиппер",6,3,"ST","02:46:08.470"]
["26-НеоБастардс-8","26-НеоБастардс",8,3,"ST","02:47:04.220"]
["30-АРАБЕЛЛА-6","30-АРАБЕЛЛА",6,2,"ST","02:47:14.270"]
["23-Мышь -7","23-Мышь ",7,9,"ST","02:49:51.030"]
["2-127-9","2-127",9,1,"ST","02:51:21.680"]
["13-Аьоке!-7","13-Аьоке!",7,9,"ST","02:52:41.650"]
["12-Чистые лапки-7","12-Чистые лапки",7,7,"ST","02:52:58.870"]
["24-Антилопы ГНУ-8","24-Антилопы ГНУ",8,4,"ST","02:53:30.990"]
["6-Уан Туз-7","6-Уан Туз",7,2,"ST","02:54:59.460"]
["4-Страус-7","4-Страус",7,5,"ST","02:55:09.210"]
["25-Черный плащ-7","25-Черный плащ",7,1,"ST","02:55:26.950"]
["5-Атом-9","5-Атом",9,6,"ST","02:56:26.510"]
["3-4x4-6","3-4x4",6,8,"ST","02:57:07.180"]
["15-Нефть-8","15-Нефть",8,3,"ST","02:57:58.470"]
["11-Артур Пирожков-5","11-Артур Пирожков",5,1,"ST","02:59:24.960"]
["30-АРАБЕЛЛА-7","30-АРАБЕЛЛА",7,4,"ST","02:59:45.330"]
["21-Партизаны Германа-8","21-Партизаны Германа",8,5,"ST","03:00:16.220"]
["19-Турбо-Зиппер-7","19-Турбо-Зиппер",7,4,"ST","03:00:48.540"]
["16-Коты-7","16-Коты",7,2,"ST","03:01:07.290"]
["6-Уан Туз-8","6-Уан Туз",8,5,"ST","03:02:20.580"]
["27-Всем пыждец-8","27-Всем пыждец",8,2,"ST","03:02:31.390"]
["26-НеоБастардс-9","26-НеоБастардс",9,1,"ST","03:02:53.180"]
["12-Чистые лапки-8","12-Чистые лапки",8,9,"ST","03:03:18.720"]
["7-ПИОНЕРЫ-6","7-ПИОНЕРЫ",6,5,"ST","22:05:13.470"]

{"sheet":"Форма ввода","index":5,"n_rows":18,"n_cols":12,"rows_kept":18}
[{"$nulls":8},"Команда","Отметка","Время отметки"]
[null,"Поступил сигнал:",{"$nulls":6},{"$f":"C3","v":"1-Трипыши"},"ST",{"$f":"DMAX('База выдачи'!B:F,5,'Форма ввода'!I1:J2)","v":"02:20:12.050"},"Текущее время старта последнего задания"]
[null,"Выберите команду",{"$f":"INDEX(Статистика!B2:B37,D3)","v":"1-Трипыши"},2]
[null,"Порядковый номер текущего задания:",{"$f":"IF(C3=\"Название команды\",\"\",DGET('База выдачи'!B:F,2,'Форма ввода'!I1:K2))","v":5}]
[null,"Выполняется задание под буквой:",{"$f":"IF(C3=\"Название команды\",\"\",INDEX(Задания!1:1048576,MATCH(C3,Задания!B:B,0),MATCH(C4,Задания!1:1,0)))","v":4},null,null,"Код",{"$f":"IF(C3=\"Название команды\",\"\",\"Код: \"&VLOOKUP(C5,Служебный!H:I,2,0))","v":"Код: 110Р"}]
[]
[null,"Время выдачи задания:",{"$f":"K2","v":"02:20:12.050"}]
[null,"Текущее время:",{"$f":"NOW()-TODAY()","v":"13:43:42.210"},null,null,"Прошло с момента начала игры:",{"$f":"C8-C7","v":"11:23:30.160"}]
[null,"Прошло с момента выдачи задания:",{"$f":"C8-C7","v":"11:23:30.160"},null,null,"Осталось до окончания игры:",{"$f":"Служебный!O6-'Форма ввода'!C8","v":-0.4449329861085668}]
[null,"минут",{"$f":"HOUR(C9)*60+MINUTE(C9)","v":683}]
[]
[null,"Выберите отметку",{"$f":"INDEX(Служебный!K2:K4,'Форма ввода'!D12)","v":0},1]
[null,null,{"$f":"COUNTIF(База!A:A,'Форма ввода'!C3&\"-\"&'Форма ввода'!C17)","v":0}]
[]
[null,"Выдать задание:"]
[null,"Команда:",{"$f":"C3","v":"1-Трипыши"}]
[null,"Порядковый номер следующего задания:",6,null,"это рекомендация компьютера. Можно изменить вручную"]
[null,"Буква следующего задания:",{"$f":"IF(C16=\"Название команды\",\"\",INDEX(Задания!1:1048576,MATCH(C16,Задания!B:B,0),MATCH(C17,Задания!1:1,0)))","v":6}]

{"sheet":"Статистика","index":6,"n_rows":37,"n_cols":128,"rows_kept":37,"merged":[[0,2,0,4],[0,5,0,7],[0,8,0,10],[0,11,0,13],[0,14,0,16],[0,17,0,19],[0,20,0,22],[0,23,0,25],[0,26,0,28],[0,29,0,31],[0,32,0,34],[0,35,0,37],[0,38,0,40],[0,41,0,43],[0,44,0,46]]}
[null,"порядковый номер задания -->",1,null,null,2,null,null,3,null,null,4,null,null,5,null,null,6,null,null,7,null,null,8,null,null,9,null,null,10,null,null,11,null,null,12,null,null,13,null,null,14,null,null,15,{"$nulls":5},"Вычисление места",{"$nulls":7},"Команда","Отметка","Команда","Отметка","Команда","Отметка","Команда","Отметка","Команда","Отметка","Команда","Отметка","Команда","Отметка","Команда","Отметка","Команда","Отметка","Команда","Отметка","Команда","Отметка","Команда","Отметка","Команда","Отметка","Команда","Отметка","Команда","Отметка","Команда","Отметка","Команда","Отметка","Команда","Отметка","Команда","Отметка","Команда","Отметка","Команда","Отметка","Команда","Отметка","Команда","Отметка","Команда","Отметка","Команда","Отметка","Команда","Отметка","Команда","Отметка","Команда","Отметка","Команда","Отметка","Команда","Отметка","Команда","Отметка","Команда","Отметка","Команда","Отметка","Команда","Отметка","Команда","Отметка"]
["№ ком","Название команды","№","отметка","время","№","отметка","время","№","отметка","время","№","отметка","время","№","отметка","время","№","отметка","время","№","отметка","время","№","отметка","время","№","отметка","время","№","отметка","время","№","отметка","время","№","отметка","время","№","отметка","время","№","отметка","время","№","отметка","время",null,null,"Сколько выполненных  заданий","Максимальное время выполнения последнего задания","Сколько секунд","Сколько невыполненных заданий","коэффициент удачи","Разнарядка по местам","Порядок","Место",null,{"$f":"B3","v":"1-Трипыши"},"OK",{"$f":"B4","v":"2-127"},"OK",{"$f":"B5","v":"3-4x4"},"OK",{"$f":"B6","v":"4-Страус"},"OK",{"$f":"B7","v":"5-Атом"},"OK",{"$f":"B8","v":"6-Уан Туз"},"OK",{"$f":"B9","v":"7-ПИОНЕРЫ"},"OK",{"$f":"B10","v":"8-Корпорация счастья"},"OK",{"$f":"B11","v":"9-Джи 3"},"OK",{"$f":"B12","v":"10-Т-34"},"OK",{"$f":"B13","v":"11-Артур Пирожков"},"OK",{"$f":"B14","v":"12-Чистые лапки"},"OK",{"$f":"B15","v":"13-Аьоке!"},"OK",{"$f":"B16","v":"14-Лева&Тигра"},"OK",{"$f":"B17","v":"15-Нефть"},"OK",{"$f":"B18","v":"16-Коты"},"OK",{"$f":"B19","v":"17-ЭросоМания"},"OK",{"$f":"B20","v":"18-Юнги"},"OK",{"$f":"B21","v":"19-Турбо-Зиппер"},"OK",{"$f":"B22","v":"20-Дети шпионов"},"OK",{"$f":"B23","v":"21-Партизаны Германа"},"OK",{"$f":"B24","v":"22-СанчеЗ&Ко"},"OK",{"$f":"B25","v":"23-Мышь "},"OK",{"$f":"B26","v":"24-Антилопы ГНУ"},"OK",{"$f":"B27","v":"25-Черный плащ"},"OK",{"$f":"B28","v":"26-НеоБастардс"},"OK",{"$f":"B29","v":"27-Всем пыждец"},"OK",{"$f":"B30","v":"28-Тригада"},"OK",{"$f":"B31","v":"29-ЛеТим"},"OK",{"$f":"B32","v":"30-АРАБЕЛЛА"},"OK",{"$f":"B33","v":""},"OK",{"$f":"B34","v":""},"OK",{"$f":"B35","v":""},"OK",{"$f":"B36","v":""},"OK",{"$f":"B37","v":""},"OK"]
[1,{"$f":"IF(ISERROR(VLOOKUP(A3,Служебный!B:C,2,0)),\"\",A3&\"-\"&VLOOKUP(A3,Служебный!B:C,2,0))","v":"1-Трипыши"},{"$f":"VLOOKUP($A3,ТаблицаЗаданий,C$1+2,0)","v":1},{"$f":"IF(ISERROR(VLOOKUP(CONCATENATE($B3,\"-\",C$1),База!$A:$G,5,0)),IF(ISERROR(VLOOKUP(CONCATENATE($B3,\"-\",C$1),'База выдачи'!$A:$F,5,0)),\"\",VLOOKUP(CONCATENATE($B3,\"-\",C$1),'База выдачи'!$A:$F,5,0)),VLOOKUP(CONCATENATE($B3,\"-\",C$1),База!$A:$G,5,0))","v":"XXXX"},{"$f":"IF(ISERROR(VLOOKUP(CONCATENATE($B3,\"-\",C$1),База!$A:$G,6,0)),IF(ISERROR(VLOOKUP(CONCATENATE($B3,\"-\",C$1),'База выдачи'!$A:$F,6,0)),\"\",VLOOKUP(CONCATENATE($B3,\"-\",C$1),'База выдачи'!$A:$F,6,0)),VLOOKUP(CONCATENATE($B3,\"-\",C$1),База!$A:$G,6,0))","v":"01:13:59.030"},{"$f":"VLOOKUP($A3,ТаблицаЗаданий,F$1+2,0)","v":3},{"$f":"IF(ISERROR(VLOOKUP(CONCATENATE($B3,\"-\",F$1),База!$A:$G,5,0)),IF(ISERROR(VLOOKUP(CONCATENATE($B3,\"-\",F$1),'База выдачи'!$A:$F,5,0)),\"\",VLOOKUP(CONCATENATE($B3,\"-\",F$1),'База выдачи'!$A:$F,5,0)),VLOOKUP(CONCATENATE($B3,\"-\",F$1),База!$A:$G,5,0))","v":"OK"},{"$f":"IF(ISERROR(VLOOKUP(CONCATENATE($B3,\"-\",F$1),База!$A:$G,6,0)),IF(ISERROR(VLOOKUP(CONCATENATE($B3,\"-\",F$1),'База выдачи'!$A:$F,6,0)),\"\",VLOOKUP(CONCATENATE($B3,\"-\",F$1),'База выдачи'!$A:$F,6,0)),VLOOKUP(CONCATENATE($B3,\"-\",F$1),База!$A:$G,6,0))","v":"01:32:05.590"},{"$f":"VLOOKUP($A3,ТаблицаЗаданий,I$1+2,0)","v":5},{"$f":"IF(ISERROR(VLOOKUP(CONCATENATE($B3,\"-\",I$1),База!$A:$G,5,0)),IF(ISERROR(VLOOKUP(CONCATENATE($B3,\"-\",I$1),'База выдачи'!$A:$F,5,0)),\"\",VLOOKUP(CONCATENATE($B3,\"-\",I$1),'База выдачи'!$A:$F,5,0)),VLOOKUP(CONCATENATE($B3,\"-\",I$1),База!$A:$G,5,0))","v":"OK"},{"$f":"IF(ISERROR(VLOOKUP(CONCATENATE($B3,\"-\",I$1),База!$A:$G,6,0)),IF(ISERROR(VLOOKUP(CONCATENATE($B3,\"-\",I$1),'База выдачи'!$A:$F,6,0)),\"\",VLOOKUP(CONCATENATE($B3,\"-\",I$1),'База выдачи'!$A:$F,6,0)),VLOOKUP(CONCATENATE($B3,\"-\",I$1),База!$A:$G,6,0))","v":"01:49:39.190"},{"$f":"VLOOKUP($A3,ТаблицаЗаданий,L$1+2,0)","v":2},{"$f":"IF(ISERROR(VLOOKUP(CONCATENATE($B3,\"-\",L$1),База!$A:$G,5,0)),IF(ISERROR(VLOOKUP(CONCATENATE($B3,\"-\",L$1),'База выдачи'!$A:$F,5,0)),\"\",VLOOKUP(CONCATENATE($B3,\"-\",L$1),'База выдачи'!$A:$F,5,0)),VLOOKUP(CONCATENATE($B3,\"-\",L$1),База!$A:$G,5,0))","v":"OK"},{"$f":"IF(ISERROR(VLOOKUP(CONCATENATE($B3,\"-\",L$1),База!$A:$G,6,0)),IF(ISERROR(VLOOKUP(CONCATENATE($B3,\"-\",L$1),'База выдачи'!$A:$F,6,0)),\"\",VLOOKUP(CONCATENATE($B3,\"-\",L$1),'База выдачи'!$A:$F,6,0)),VLOOKUP(CONCATENATE($B3,\"-\",L$1),База!$A:$G,6,0))","v":"02:20:10.200"},{"$f":"VLOOKUP($A3,ТаблицаЗаданий,O$1+2,0)","v":4},{"$f":"IF(ISERROR(VLOOKUP(CONCATENATE($B3,\"-\",O$1),База!$A:$G,5,0)),IF(ISERROR(VLOOKUP(CONCATENATE($B3,\"-\",O$1),'База выдачи'!$A:$F,5,0)),\"\",VLOOKUP(CONCATENATE($B3,\"-\",O$1),'База выдачи'!$A:$F,5,0)),VLOOKUP(CONCATENATE($B3,\"-\",O$1),База!$A:$G,5,0))","v":"ST"},{"$f":"IF(ISERROR(VLOOKUP(CONCATENATE($B3,\"-\",O$1),База!$A:$G,6,0)),IF(ISERROR(VLOOKUP(CONCATENATE($B3,\"-\",O$1),'База выдачи'!$A:$F,6,0)),\"\",VLOOKUP(CONCATENATE($B3,\"-\",O$1),'База выдачи'!$A:$F,6,0)),VLOOKUP(CONCATENATE($B3,\"-\",O$1),База!$A:$G,6,0))","v":"02:20:12.050"},{"$f":"VLOOKUP($A3,ТаблицаЗаданий,R$1+2,0)","v":6},{"$f":"IF(ISERROR(VLOOKUP(CONCATENATE($B3,\"-\",R$1),База!$A:$G,5,0)),IF(ISERROR(VLOOKUP(CONCATENATE($B3,\"-\",R$1),'База выдачи'!$A:$F,5,0)),\"\",VLOOKUP(CONCATENATE($B3,\"-\",R$1),'База выдачи'!$A:$F,5,0)),VLOOKUP(CONCATENATE($B3,\"-\",R$1),База!$A:$G,5,0))","v":""},{"$f":"IF(ISERROR(VLOOKUP(CONCATENATE($B3,\"-\",R$1),База!$A:$G,6,0)),IF(ISERROR(VLOOKUP(CONCATENATE($B3,\"-\",R$1),'База выдачи'!$A:$F,6,0)),\"\",VLOOKUP(CONCATENATE($B3,\"-\",R$1),'База выдачи'!$A:$F,6,0)),VLOOKUP(CONCATENATE($B3,\"-\",R$1),База!$A:$G,6,0))","v":""},{"$f":"VLOOKUP($A3,ТаблицаЗаданий,U$1+2,0)","v":8},{"$f":"IF(ISERROR(VLOOKUP(CONCATENATE($B3,\"-\",U$1),База!$A:$G,5,0)),IF(ISERROR(VLOOKUP(CONCATENATE($B3,\"-\",U$1),'База выдачи'!$A:$F,5,0)),\"\",VLOOKUP(CONCATENATE($B3,\"-\",U$1),'База выдачи'!$A:$F,5,0)),VLOOKUP(CONCATENATE($B3,\"-\",U$1),База!$A:$G,5,0))","v":""},{"$f":"IF(ISERROR(VLOOKUP(CONCATENATE($B3,\"-\",U$1),База!$A:$G,6,0)),IF(ISERROR(VLOOKUP(CONCATENATE($B3,\"-\",U$1),'База выдачи'!$A:$F,6,0)),\"\",VLOOKUP(CONCATENATE($B3,\"-\",U$1),'База выдачи'!$A:$F,6,0)),VLOOKUP(CONCATENATE($B3,\"-\",U$1),База!$A:$G,6,0))","v":""},{"$f":"VLOOKUP($A3,ТаблицаЗаданий,X$1+2,0)","v":7},{"$f":"IF(ISERROR(VLOOKUP(CONCATENATE($B3,\"-\",X$1),База!$A:$G,5,0)),IF(ISERROR(VLOOKUP(CONCATENATE($B3,\"-\",X$1),'База выдачи'!$A:$F,5,0)),\"\",VLOOKUP(CONCATENATE($B3,\"-\",X$1),'База выдачи'!$A:$F,5,0)),VLOOKUP(CONCATENATE($B3,\"-\",X$1),База!$A:$G,5,0))","v":""},{"$f":"IF(ISERROR(VLOOKUP(CONCATENATE($B3,\"-\",X$1),База!$A:$G,6,0)),IF(ISERROR(VLOOKUP(CONCATENATE($B3,\"-\",X$1),'База выдачи'!$A:$F,6,0)),\"\",VLOOKUP(CONCATENATE($B3,\"-\",X$1),'База выдачи'!$A:$F,6,0)),VLOOKUP(CONCATENATE($B3,\"-\",X$1),База!$A:$G,6,0))","v":""},{"$f":"VLOOKUP($A3,ТаблицаЗаданий,AA$1+2,0)","v":9},{"$f":"IF(ISERROR(VLOOKUP(CONCATENATE($B3,\"-\",AA$1),База!$A:$G,5,0)),IF(ISERROR(VLOOKUP(CONCATENATE($B3,\"-\",AA$1),'База выдачи'!$A:$F,5,0)),\"\",VLOOKUP(CONCATENATE($B3,\"-\",AA$1),'База выдачи'!$A:$F,5,0)),VLOOKUP(CONCATENATE($B3,\"-\",AA$1),База!$A:$G,5,0))","v":""},{"$f":"IF(ISERROR(VLOOKUP(CONCATENATE($B3,\"-\",AA$1),База!$A:$G,6,0)),IF(ISERROR(VLOOKUP(CONCATENATE($B3,\"-\",AA$1),'База выдачи'!$A:$F,6,0)),\"\",VLOOKUP(CONCATENATE($B3,\"-\",AA$1),'База выдачи'!$A:$F,6,0)),VLOOKUP(CONCATENATE($B3,\"-\",AA$1),База!$A:$G,6,0))","v":""},{"$f":"VLOOKUP($A3,ТаблицаЗаданий,AD$1+2,0)","v":"J"},{"$f":"IF(ISERROR(VLOOKUP(CONCATENATE($B3,\"-\",AD$1),База!$A:$G,5,0)),IF(ISERROR(VLOOKUP(CONCATENATE($B3,\"-\",AD$1),'База выдачи'!$A:$F,5,0)),\"\",VLOOKUP(CONCATENATE($B3,\"-\",AD$1),'База выдачи'!$A:$F,5,0)),VLOOKUP(CONCATENATE($B3,\"-\",AD$1),База!$A:$G,5,0))","v":""},{"$f":"IF(ISERROR(VLOOKUP(CONCATENATE($B3,\"-\",AD$1),База!$A:$G,6,0)),IF(ISERROR(VLOOKUP(CONCATENATE($B3,\"-\",AD$1),'База выдачи'!$A:$F,6,0)),\"\",VLOOKUP(CONCATENATE($B3,\"-\",AD$1),'База выдачи'!$A:$F,6,0)),VLOOKUP(CONCATENATE($B3,\"-\",AD$1),База!$A:$G,6,0))","v":""},{"$f":"VLOOKUP($A3,ТаблицаЗаданий,AG$1+2,0)","v":"K"},{"$f":"IF(ISERROR(VLOOKUP(CONCATENATE($B3,\"-\",AG$1),База!$A:$G,5,0)),IF(ISERROR(VLOOKUP(CONCATENATE($B3,\"-\",AG$1),'База выдачи'!$A:$F,5,0)),\"\",VLOOKUP(CONCATENATE($B3,\"-\",AG$1),'База выдачи'!$A:$F,5,0)),VLOOKUP(CONCATENATE($B3,\"-\",AG$1),База!$A:$G,5,0))","v":""},{"$f":"IF(ISERROR(VLOOKUP(CONCATENATE($B3,\"-\",AG$1),База!$A:$G,6,0)),IF(ISERROR(VLOOKUP(CONCATENATE($B3,\"-\",AG$1),'База выдачи'!$A:$F,6,0)),\"\",VLOOKUP(CONCATENATE($B3,\"-\",AG$1),'База выдачи'!$A:$F,6,0)),VLOOKUP(CONCATENATE($B3,\"-\",AG$1),База!$A:$G,6,0))","v":""},{"$f":"VLOOKUP($A3,ТаблицаЗаданий,AJ$1+2,0)","v":"L"},{"$f":"IF(ISERROR(VLOOKUP(CONCATENATE($B3,\"-\",AJ$1),База!$A:$G,5,0)),IF(ISERROR(VLOOKUP(CONCATENATE($B3,\"-\",AJ$1),'База выдачи'!$A:$F,5,0)),\"\",VLOOKUP(CONCATENATE($B3,\"-\",AJ$1),'База выдачи'!$A:$F,5,0)),VLOOKUP(CONCATENATE($B3,\"-\",AJ$1),База!$A:$G,5,0))","v":""},{"$f":"IF(ISERROR(VLOOKUP(CONCATENATE($B3,\"-\",AJ$1),База!$A:$G,6,0)),IF(ISERROR(VLOOKUP(CONCATENATE($B3,\"-\",AJ$1),'База выдачи'!$A:$F,6,0)),\"\",VLOOKUP(CONCATENATE($B3,\"-\",AJ$1),'База выдачи'!$A:$F,6,0)),VLOOKUP(CONCATENATE($B3,\"-\",AJ$1),База!$A:$G,6,0))","v":""},{"$f":"VLOOKUP($A3,ТаблицаЗаданий,AM$1+2,0)","v":"M"},{"$f":"IF(ISERROR(VLOOKUP(CONCATENATE($B3,\"-\",AM$1),База!$A:$G,5,0)),IF(ISERROR(VLOOKUP(CONCATENATE($B3,\"-\",AM$1),'База выдачи'!$A:$F,5,0)),\"\",VLOOKUP(CONCATENATE($B3,\"-\",AM$1),'База выдачи'!$A:$F,5,0)),VLOOKUP(CONCATENATE($B3,\"-\",AM$1),База!$A:$G,5,0))","v":""},{"$f":"IF(ISERROR(VLOOKUP(CONCATENATE($B3,\"-\",AM$1),База!$A:$G,6,0)),IF(ISERROR(VLOOKUP(CONCATENATE($B3,\"-\",AM$1),'База выдачи'!$A:$F,6,0)),\"\",VLOOKUP(CONCATENATE($B3,\"-\",AM$1),'База выдачи'!$A:$F,6,0)),VLOOKUP(CONCATENATE($B3,\"-\",AM$1),База!$A:$G,6,0))","v":""},{"$f":"VLOOKUP($A3,ТаблицаЗаданий,AP$1+2,0)","v":"N"},{"$f":"IF(ISERROR(VLOOKUP(CONCATENATE($B3,\"-\",AP$1),База!$A:$G,5,0)),IF(ISERROR(VLOOKUP(CONCATENATE($B3,\"-\",AP$1),'База выдачи'!$A:$F,5,0)),\"\",VLOOKUP(CONCATENATE($B3,\"-\",AP$1),'База выдачи'!$A:$F,5,0)),VLOOKUP(CONCATENATE($B3,\"-\",AP$1),База!$A:$G,5,0))","v":""},{"$f":"IF(ISERROR(VLOOKUP(CONCATENATE($B3,\"-\",AP$1),База!$A:$G,6,0)),IF(ISERROR(VLOOKUP(CONCATENATE($B3,\"-\",AP$1),'База выдачи'!$A:$F,6,0)),\"\",VLOOKUP(CONCATENATE($B3,\"-\",AP$1),'База выдачи'!$A:$F,6,0)),VLOOKUP(CONCATENATE($B3,\"-\",AP$1),База!$A:$G,6,0))","v":""},{"$f":"VLOOKUP($A3,ТаблицаЗаданий,AS$1+2,0)","v":"O"},{"$f":"IF(ISERROR(VLOOKUP(CONCATENATE($B3,\"-\",AS$1),База!$A:$G,5,0)),IF(ISERROR(VLOOKUP(CONCATENATE($B3,\"-\",AS$1),'База выдачи'!$A:$F,5,0)),\"\",VLOOKUP(CONCATENATE($B3,\"-\",AS$1),'База выдачи'!$A:$F,5,0)),VLOOKUP(CONCATENATE($B3,\"-\",AS$1),База!$A:$G,5,0))","v":""},{"$f":"IF(ISERROR(VLOOKUP(CONCATENATE($B3,\"-\",AS$1),База!$A:$G,6,0)),IF(ISERROR(VLOOKUP(CONCATENATE($B3,\"-\",AS$1),'База выдачи'!$A:$F,6,0)),\"\",VLOOKUP(CONCATENATE($B3,\"-\",AS$1),'База выдачи'!$A:$F,6,0)),VLOOKUP(CONCATENATE($B3,\"-\",AS$1),База!$A:$G,6,0))","v":""},null,null,{"$f":"COUNTIFS(База!B:B,Статистика!B3,База!E:E,\"OK\")","v":3},{"$f":"BG3","v":"02:20:10.200"},{"$f":"HOUR(AY3)*3600+MINUTE(AY3)*60+SECOND(AY3)","v":8410},{"$f":"COUNTIFS(База!B:B,Статистика!B3,База!E:E,\"XXXX\")","v":1},{"$f":"IF(AX3+AZ3+BA3=0,ксекундвигре-BD3,ксекундвигре*Статистика!AX3+(ксекундвигре-Статистика!AZ3)+Статистика!BA3)","v":35031},{"$f":"LARGE(BB:BB,BD3)","v":87460},{"$f":"N(BD2)+1","v":1},{"$f":"MATCH(BC3,$BB$3:$BB$37,0)","v":2},null,{"$f":"DMAX(База!$A:$G,6,Статистика!BG1:BH2)","v":"02:20:10.200"},null,{"$f":"DMAX(База!$A:$G,6,Статистика!BI1:BJ2)","v":"02:51:19.780"},null,{"$f":"DMAX(База!$A:$G,6,Статистика!BK1:BL2)","v":"02:57:05.240"},null,{"$f":"DMAX(База!$A:$G,6,Статистика!BM1:BN2)","v":"02:55:07.310"},null,{"$f":"DMAX(База!$A:$G,6,Статистика!BO1:BP2)","v":"02:56:24.590"},null,{"$f":"DMAX(База!$A:$G,6,Статистика!BQ1:BR2)","v":"03:02:18.680"},null,{"$f":"DMAX(База!$A:$G,6,Статистика!BS1:BT2)","v":"02:34:54.090"},null,{"$f":"DMAX(База!$A:$G,6,Статистика!BU1:BV2)","v":"02:38:28.780"},null,{"$f":"DMAX(База!$A:$G,6,Статистика!BW1:BX2)","v":"02:23:59.360"},null,{"$f":"DMAX(База!$A:$G,6,Статистика!BY1:BZ2)","v":"02:09:27.150"},null,{"$f":"DMAX(База!$A:$G,6,Статистика!CA1:CB2)","v":"02:59:22.990"},null,{"$f":"DMAX(База!$A:$G,6,Статистика!CC1:CD2)","v":"03:03:16.770"},null,{"$f":"DMAX(База!$A:$G,6,Статистика!CE1:CF2)","v":"02:52:39.730"},null,{"$f":"DMAX(База!$A:$G,6,Статистика!CG1:CH2)","v":"02:28:11.470"},null,{"$f":"DMAX(База!$A:$G,6,Статистика!CI1:CJ2)","v":"02:57:56.530"},null,{"$f":"DMAX(База!$A:$G,6,Статистика!CK1:CL2)","v":"03:01:05.370"},null,{"$f":"DMAX(База!$A:$G,6,Статистика!CM1:CN2)","v":"02:37:18.410"},null,{"$f":"DMAX(База!$A:$G,6,Статистика!CO1:CP2)","v":"02:40:27.570"},null,{"$f":"DMAX(База!$A:$G,6,Статистика!CQ1:CR2)","v":"03:00:46.620"},null,{"$f":"DMAX(База!$A:$G,6,Статистика!CS1:CT2)","v":"02:39:58.920"},null,{"$f":"DMAX(База!$A:$G,6,Статистика!CU1:CV2)","v":"03:00:14.250"},null,{"$f":"DMAX(База!$A:$G,6,Статистика!CW1:CX2)","v":"01:47:56.470"},null,{"$f":"DMAX(База!$A:$G,6,Статистика!CY1:CZ2)","v":"02:49:49.140"},null,{"$f":"DMAX(База!$A:$G,6,Статистика!DA1:DB2)","v":"02:53:29.070"},null,{"$f":"DMAX(База!$A:$G,6,Статистика!DC1:DD2)","v":"02:55:25.040"},null,{"$f":"DMAX(База!$A:$G,6,Статистика!DE1:DF2)","v":"03:02:51.270"},null,{"$f":"DMAX(База!$A:$G,6,Статистика!DG1:DH2)","v":"03:02:29.460"},null,{"$f":"DMAX(База!$A:$G,6,Статистика!DI1:DJ2)","v":"02:37:45.800"},null,{"$f":"DMAX(База!$A:$G,6,Статистика!DK1:DL2)","v":"02:38:11.370"},null,{"$f":"DMAX(База!$A:$G,6,Статистика!DM1:DN2)","v":"02:59:43.410"},null,{"$f":"DMAX(База!$A:$G,6,Статистика!DO1:DP2)","v":"03:03:16.770"},null,{"$f":"DMAX(База!$A:$G,6,Статистика!DQ1:DR2)","v":"03:03:16.770"},null,{"$f":"DMAX(База!$A:$G,6,Статистика!DS1:DT2)","v":"03:03:16.770"},null,{"$f":"DMAX(База!$A:$G,6,Статистика!DU1:DV2)","v":"03:03:16.770"},null,{"$f":"DMAX(База!$A:$G,6,Статистика!DW1:DX2)","v":"03:03:16.770"}]
[2,{"$f":"IF(ISERROR(VLOOKUP(A4,Служебный!B:C,2,0)),\"\",A4&\"-\"&VLOOKUP(A4,Служебный!B:C,2,0))","v":"2-127"},2,{"$f":"IF(ISERROR(VLOOKUP(CONCATENATE($B4,\"-\",C$1),База!$A:$G,5,0)),IF(ISERROR(VLOOKUP(CONCATENATE($B4,\"-\",C$1),'База выдачи'!$A:$F,5,0)),\"\",VLOOKUP(CONCATENATE($B4,\"-\",C$1),'База выдачи'!$A:$F,5,0)),VLOOKUP(CONCATENATE($B4,\"-\",C$1),База!$A:$G,5,0))","v":"OK"},{"$f":"IF(ISERROR(VLOOKUP(CONCATENATE($B4,\"-\",C$1),База!$A:$G,6,0)),IF(ISERROR(VLOOKUP(CONCATENATE($B4,\"-\",C$1),'База выдачи'!$A:$F,6,0)),\"\",VLOOKUP(CONCATENATE($B4,\"-\",C$1),'База выдачи'!$A:$F,6,0)),VLOOKUP(CONCATENATE($B4,\"-\",C$1),База!$A:$G,6,0))","v":"00:36:29.420"},4,{"$f":"IF(ISERROR(VLOOKUP(CONCATENATE($B4,\"-\",F$1),База!$A:$G,5,0)),IF(ISERROR(VLOOKUP(CONCATENATE($B4,\"-\",F$1),'База выдачи'!$A:$F,5,0)),\"\",VLOOKUP(CONCATENATE($B4,\"-\",F$1),'База выдачи'!$A:$F,5,0)),VLOOKUP(CONCATENATE($B4,\"-\",F$1),База!$A:$G,5,0))","v":"OK"},{"$f":"IF(ISERROR(VLOOKUP(CONCATENATE($B4,\"-\",F$1),База!$A:$G,6,0)),IF(ISERROR(VLOOKUP(CONCATENATE($B4,\"-\",F$1),'База выдачи'!$A:$F,6,0)),\"\",VLOOKUP(CONCATENATE($B4,\"-\",F$1),'База выдачи'!$A:$F,6,0)),VLOOKUP(CONCATENATE($B4,\"-\",F$1),База!$A:$G,6,0))","v":"00:50:34.560"},3,{"$f":"IF(ISERROR(VLOOKUP(CONCATENATE($B4,\"-\",I$1),База!$A:$G,5,0)),IF(ISERROR(VLOOKUP(CONCATENATE($B4,\"-\",I$1),'База выдачи'!$A:$F,5,0)),\"\",VLOOKUP(CONCATENATE($B4,\"-\",I$1),'База выдачи'!$A:$F,5,0)),VLOOKUP(CONCATENATE($B4,\"-\",I$1),База!$A:$G,5,0))","v":"OK"},{"$f":"IF(ISERROR(VLOOKUP(CONCATENATE($B4,\"-\",I$1),База!$A:$G,6,0)),IF(ISERROR(VLOOKUP(CONCATENATE($B4,\"-\",I$1),'База выдачи'!$A:$F,6,0)),\"\",VLOOKUP(CONCATENATE($B4,\"-\",I$1),'База выдачи'!$A:$F,6,0)),VLOOKUP(CONCATENATE($B4,\"-\",I$1),База!$A:$G,6,0))","v":"00:56:39.200"},5,{"$f":"IF(ISERROR(VLOOKUP(CONCATENATE($B4,\"-\",L$1),База!$A:$G,5,0)),IF(ISERROR(VLOOKUP(CONCATENATE($B4,\"-\",L$1),'База выдачи'!$A:$F,5,0)),\"\",VLOOKUP(CONCATENATE($B4,\"-\",L$1),'База выдачи'!$A:$F,5,0)),VLOOKUP(CONCATENATE($B4,\"-\",L$1),База!$A:$G,5,0))","v":"OK"},{"$f":"IF(ISERROR(VLOOKUP(CONCATENATE($B4,\"-\",L$1),База!$A:$G,6,0)),IF(ISERROR(VLOOKUP(CONCATENATE($B4,\"-\",L$1),'База выдачи'!$A:$F,6,0)),\"\",VLOOKUP(CONCATENATE($B4,\"-\",L$1),'База выдачи'!$A:$F,6,0)),VLOOKUP(CONCATENATE($B4,\"-\",L$1),База!$A:$G,6,0))","v":"01:10:24.970"},6,{"$f":"IF(ISERROR(VLOOKUP(CONCATENATE($B4,\"-\",O$1),База!$A:$G,5,0)),IF(ISERROR(VLOOKUP(CONCATENATE($B4,\"-\",O$1),'База выдачи'!$A:$F,5,0)),\"\",VLOOKUP(CONCATENATE($B4,\"-\",O$1),'База выдачи'!$A:$F,5,0)),VLOOKUP(CONCATENATE($B4,\"-\",O$1),База!$A:$G,5,0))","v":"OK"},{"$f":"IF(ISERROR(VLOOKUP(CONCATENATE($B4,\"-\",O$1),База!$A:$G,6,0)),IF(ISERROR(VLOOKUP(CONCATENATE($B4,\"-\",O$1),'База выдачи'!$A:$F,6,0)),\"\",VLOOKUP(CONCATENATE($B4,\"-\",O$1),'База выдачи'!$A:$F,6,0)),VLOOKUP(CONCATENATE($B4,\"-\",O$1),База!$A:$G,6,0))","v":"01:40:18.140"},7,{"$f":"IF(ISERROR(VLOOKUP(CONCATENATE($B4,\"-\",R$1),База!$A:$G,5,0)),IF(ISERROR(VLOOKUP(CONCATENATE($B4,\"-\",R$1),'База выдачи'!$A:$F,5,0)),\"\",VLOOKUP(CONCATENATE($B4,\"-\",R$1),'База выдачи'!$A:$F,5,0)),VLOOKUP(CONCATENATE($B4,\"-\",R$1),База!$A:$G,5,0))","v":"OK"},{"$f":"IF(ISERROR(VLOOKUP(CONCATENATE($B4,\"-\",R$1),База!$A:$G,6,0)),IF(ISERROR(VLOOKUP(CONCATENATE($B4,\"-\",R$1),'База выдачи'!$A:$F,6,0)),\"\",VLOOKUP(CONCATENATE($B4,\"-\",R$1),'База выдачи'!$A:$F,6,0)),VLOOKUP(CONCATENATE($B4,\"-\",R$1),База!$A:$G,6,0))","v":"01:55:04.060"},9,{"$f":"IF(ISERROR(VLOOKUP(CONCATENATE($B4,\"-\",U$1),База!$A:$G,5,0)),IF(ISERROR(VLOOKUP(CONCATENATE($B4,\"-\",U$1),'База выдачи'!$A:$F,5,0)),\"\",VLOOKUP(CONCATENATE($B4,\"-\",U$1),'База выдачи'!$A:$F,5,0)),VLOOKUP(CONCATENATE($B4,\"-\",U$1),База!$A:$G,5,0))","v":"OK"},{"$f":"IF(ISERROR(VLOOKUP(CONCATENATE($B4,\"-\",U$1),База!$A:$G,6,0)),IF(ISERROR(VLOOKUP(CONCATENATE($B4,\"-\",U$1),'База выдачи'!$A:$F,6,0)),\"\",VLOOKUP(CONCATENATE($B4,\"-\",U$1),'База выдачи'!$A:$F,6,0)),VLOOKUP(CONCATENATE($B4,\"-\",U$1),База!$A:$G,6,0))","v":"02:14:40.480"},8,{"$f":"IF(ISERROR(VLOOKUP(CONCATENATE($B4,\"-\",X$1),База!$A:$G,5,0)),IF(ISERROR(VLOOKUP(CONCATENATE($B4,\"-\",X$1),'База выдачи'!$A:$F,5,0)),\"\",VLOOKUP(CONCATENATE($B4,\"-\",X$1),'База выдачи'!$A:$F,5,0)),VLOOKUP(CONCATENATE($B4,\"-\",X$1),База!$A:$G,5,0))","v":"OK"},{"$f":"IF(ISERROR(VLOOKUP(CONCATENATE($B4,\"-\",X$1),База!$A:$G,6,0)),IF(ISERROR(VLOOKUP(CONCATENATE($B4,\"-\",X$1),'База выдачи'!$A:$F,6,0)),\"\",VLOOKUP(CONCATENATE($B4,\"-\",X$1),'База выдачи'!$A:$F,6,0)),VLOOKUP(CONCATENATE($B4,\"-\",X$1),База!$A:$G,6,0))","v":"02:51:19.780"},1,{"$f":"IF(ISERROR(VLOOKUP(CONCATENATE($B4,\"-\",AA$1),База!$A:$G,5,0)),IF(ISERROR(VLOOKUP(CONCATENATE($B4,\"-\",AA$1),'База выдачи'!$A:$F,5,0)),\"\",VLOOKUP(CONCATENATE($B4,\"-\",AA$1),'База выдачи'!$A:$F,5,0)),VLOOKUP(CONCATENATE($B4,\"-\",AA$1),База!$A:$G,5,0))","v":"ST"},{"$f":"IF(ISERROR(VLOOKUP(CONCATENATE($B4,\"-\",AA$1),База!$A:$G,6,0)),IF(ISERROR(VLOOKUP(CONCATENATE($B4,\"-\",AA$1),'База выдачи'!$A:$F,6,0)),\"\",VLOOKUP(CONCATENATE($B4,\"-\",AA$1),'База выдачи'!$A:$F,6,0)),VLOOKUP(CONCATENATE($B4,\"-\",AA$1),База!$A:$G,6,0))","v":"02:51:21.680"},"I",{"$f":"IF(ISERROR(VLOOKUP(CONCATENATE($B4,\"-\",AD$1),База!$A:$G,5,0)),IF(ISERROR(VLOOKUP(CONCATENATE($B4,\"-\",AD$1),'База выдачи'!$A:$F,5,0)),\"\",VLOOKUP(CONCATENATE($B4,\"-\",AD$1),'База выдачи'!$A:$F,5,0)),VLOOKUP(CONCATENATE($B4,\"-\",AD$1),База!$A:$G,5,0))","v":""},{"$f":"IF(ISERROR(VLOOKUP(CONCATENATE($B4,\"-\",AD$1),База!$A:$G,6,0)),IF(ISERROR(VLOOKUP(CONCATENATE($B4,\"-\",AD$1),'База выдачи'!$A:$F,6,0)),\"\",VLOOKUP(CONCATENATE($B4,\"-\",AD$1),'База выдачи'!$A:$F,6,0)),VLOOKUP(CONCATENATE($B4,\"-\",AD$1),База!$A:$G,6,0))","v":""},"J",{"$f":"IF(ISERROR(VLOOKUP(CONCATENATE($B4,\"-\",AG$1),База!$A:$G,5,0)),IF(ISERROR(VLOOKUP(CONCATENATE($B4,\"-\",AG$1),'База выдачи'!$A:$F,5,0)),\"\",VLOOKUP(CONCATENATE($B4,\"-\",AG$1),'База выдачи'!$A:$F,5,0)),VLOOKUP(CONCATENATE($B4,\"-\",AG$1),База!$A:$G,5,0))","v":""},{"$f":"IF(ISERROR(VLOOKUP(CONCATENATE($B4,\"-\",AG$1),База!$A:$G,6,0)),IF(ISERROR(VLOOKUP(CONCATENATE($B4,\"-\",AG$1),'База выдачи'!$A:$F,6,0)),\"\",VLOOKUP(CONCATENATE($B4,\"-\",AG$1),'База выдачи'!$A:$F,6,0)),VLOOKUP(CONCATENATE($B4,\"-\",AG$1),База!$A:$G,6,0))","v":""},"K",{"$f":"IF(ISERROR(VLOOKUP(CONCATENATE($B4,\"-\",AJ$1),База!$A:$G,5,0)),IF(ISERROR(VLOOKUP(CONCATENATE($B4,\"-\",AJ$1),'База выдачи'!$A:$F,5,0)),\"\",VLOOKUP(CONCATENATE($B4,\"-\",AJ$1),'База выдачи'!$A:$F,5,0)),VLOOKUP(CONCATENATE($B4,\"-\",AJ$1),База!$A:$G,5,0))","v":""},{"$f":"IF(ISERROR(VLOOKUP(CONCATENATE($B4,\"-\",AJ$1),База!$A:$G,6,0)),IF(ISERROR(VLOOKUP(CONCATENATE($B4,\"-\",AJ$1),'База выдачи'!$A:$F,6,0)),\"\",VLOOKUP(CONCATENATE($B4,\"-\",AJ$1),'База выдачи'!$A:$F,6,0)),VLOOKUP(CONCATENATE($B4,\"-\",AJ$1),База!$A:$G,6,0))","v":""},"L",{"$f":"IF(ISERROR(VLOOKUP(CONCATENATE($B4,\"-\",AM$1),База!$A:$G,5,0)),IF(ISERROR(VLOOKUP(CONCATENATE($B4,\"-\",AM$1),'База выдачи'!$A:$F,5,0)),\"\",VLOOKUP(CONCATENATE($B4,\"-\",AM$1),'База выдачи'!$A:$F,5,0)),VLOOKUP(CONCATENATE($B4,\"-\",AM$1),База!$A:$G,5,0))","v":""},{"$f":"IF(ISERROR(VLOOKUP(CONCATENATE($B4,\"-\",AM$1),База!$A:$G,6,0)),IF(ISERROR(VLOOKUP(CONCATENATE($B4,\"-\",AM$1),'База выдачи'!$A:$F,6,0)),\"\",VLOOKUP(CONCATENATE($B4,\"-\",AM$1),'База выдачи'!$A:$F,6,0)),VLOOKUP(CONCATENATE($B4,\"-\",AM$1),База!$A:$G,6,0))","v":""},"M",{"$f":"IF(ISERROR(VLOOKUP(CONCATENATE($B4,\"-\",AP$1),База!$A:$G,5,0)),IF(ISERROR(VLOOKUP(CONCATENATE($B4,\"-\",AP$1),'База выдачи'!$A:$F,5,0)),\"\",VLOOKUP(CONCATENATE($B4,\"-\",AP$1),'База выдачи'!$A:$F,5,0)),VLOOKUP(CONCATENATE($B4,\"-\",AP$1),База!$A:$G,5,0))","v":""},{"$f":"IF(ISERROR(VLOOKUP(CONCATENATE($B4,\"-\",AP$1),База!$A:$G,6,0)),IF(ISERROR(VLOOKUP(CONCATENATE($B4,\"-\",AP$1),'База выдачи'!$A:$F,6,0)),\"\",VLOOKUP(CONCATENATE($B4,\"-\",AP$1),'База выдачи'!$A:$F,6,0)),VLOOKUP(CONCATENATE($B4,\"-\",AP$1),База!$A:$G,6,0))","v":""},"N",{"$f":"IF(ISERROR(VLOOKUP(CONCATENATE($B4,\"-\",AS$1),База!$A:$G,5,0)),IF(ISERROR(VLOOKUP(CONCATENATE($B4,\"-\",AS$1),'База выдачи'!$A:$F,5,0)),\"\",VLOOKUP(CONCATENATE($B4,\"-\",AS$1),'База выдачи'!$A:$F,5,0)),VLOOKUP(CONCATENATE($B4,\"-\",AS$1),База!$A:$G,5,0))","v":""},{"$f":"IF(ISERROR(VLOOKUP(CONCATENATE($B4,\"-\",AS$1),База!$A:$G,6,0)),IF(ISERROR(VLOOKUP(CONCATENATE($B4,\"-\",AS$1),'База выдачи'!$A:$F,6,0)),\"\",VLOOKUP(CONCATENATE($B4,\"-\",AS$1),'База выдачи'!$A:$F,6,0)),VLOOKUP(CONCATENATE($B4,\"-\",AS$1),База!$A:$G,6,0))","v":""},null,null,{"$f":"COUNTIFS(База!B:B,Статистика!B4,База!E:E,\"OK\")","v":8},{"$f":"BI3","v":"02:51:19.780"},{"$f":"HOUR(AY4)*3600+MINUTE(AY4)*60+SECOND(AY4)","v":10280},{"$f":"COUNTIFS(База!B:B,Статистика!B4,База!E:E,\"XXXX\")","v":0},{"$f":"IF(AX4+AZ4+BA4=0,ксекундвигре-BD4,ксекундвигре*Статистика!AX4+(ксекундвигре-Статистика!AZ4)+Статистика!BA4)","v":87460},86769,{"$f":"N(BD3)+1","v":2},26]
[3,{"$f":"IF(ISERROR(VLOOKUP(A5,Служебный!B:C,2,0)),\"\",A5&\"-\"&VLOOKUP(A5,Служебный!B:C,2,0))","v":"3-4x4"},3,{"$f":"IF(ISERROR(VLOOKUP(CONCATENATE($B5,\"-\",C$1),База!$A:$G,5,0)),IF(ISERROR(VLOOKUP(CONCATENATE($B5,\"-\",C$1),'База выдачи'!$A:$F,5,0)),\"\",VLOOKUP(CONCATENATE($B5,\"-\",C$1),'База выдачи'!$A:$F,5,0)),VLOOKUP(CONCATENATE($B5,\"-\",C$1),База!$A:$G,5,0))","v":"OK"},{"$f":"IF(ISERROR(VLOOKUP(CONCATENATE($B5,\"-\",C$1),База!$A:$G,6,0)),IF(ISERROR(VLOOKUP(CONCATENATE($B5,\"-\",C$1),'База выдачи'!$A:$F,6,0)),\"\",VLOOKUP(CONCATENATE($B5,\"-\",C$1),'База выдачи'!$A:$F,6,0)),VLOOKUP(CONCATENATE($B5,\"-\",C$1),База!$A:$G,6,0))","v":"00:34:01.140"},5,{"$f":"IF(ISERROR(VLOOKUP(CONCATENATE($B5,\"-\",F$1),База!$A:$G,5,0)),IF(ISERROR(VLOOKUP(CONCATENATE($B5,\"-\",F$1),'База выдачи'!$A:$F,5,0)),\"\",VLOOKUP(CONCATENATE($B5,\"-\",F$1),'База выдачи'!$A:$F,5,0)),VLOOKUP(CONCATENATE($B5,\"-\",F$1),База!$A:$G,5,0))","v":"OK"},{"$f":"IF(ISERROR(VLOOKUP(CONCATENATE($B5,\"-\",F$1),База!$A:$G,6,0)),IF(ISERROR(VLOOKUP(CONCATENATE($B5,\"-\",F$1),'База выдачи'!$A:$F,6,0)),\"\",VLOOKUP(CONCATENATE($B5,\"-\",F$1),'База выдачи'!$A:$F,6,0)),VLOOKUP(CONCATENATE($B5,\"-\",F$1),База!$A:$G,6,0))","v":"01:05:02.970"},2,{"$f":"IF(ISERROR(VLOOKUP(CONCATENATE($B5,\"-\",I$1),База!$A:$G,5,0)),IF(ISERROR(VLOOKUP(CONCATENATE($B5,\"-\",I$1),'База выдачи'!$A:$F,5,0)),\"\",VLOOKUP(CONCATENATE($B5,\"-\",I$1),'База выдачи'!$A:$F,5,0)),VLOOKUP(CONCATENATE($B5,\"-\",I$1),База!$A:$G,5,0))","v":"XXXX"},{"$f":"IF(ISERROR(VLOOKUP(CONCATENATE($B5,\"-\",I$1),База!$A:$G,6,0)),IF(ISERROR(VLOOKUP(CONCATENATE($B5,\"-\",I$1),'База выдачи'!$A:$F,6,0)),\"\",VLOOKUP(CONCATENATE($B5,\"-\",I$1),'База выдачи'!$A:$F,6,0)),VLOOKUP(CONCATENATE($B5,\"-\",I$1),База!$A:$G,6,0))","v":"01:46:37.060"},6,{"$f":"IF(ISERROR(VLOOKUP(CONCATENATE($B5,\"-\",L$1),База!$A:$G,5,0)),IF(ISERROR(VLOOKUP(CONCATENATE($B5,\"-\",L$1),'База выдачи'!$A:$F,5,0)),\"\",VLOOKUP(CONCATENATE($B5,\"-\",L$1),'База выдачи'!$A:$F,5,0)),VLOOKUP(CONCATENATE($B5,\"-\",L$1),База!$A:$G,5,0))","v":"XXXX"},{"$f":"IF(ISERROR(VLOOKUP(CONCATENATE($B5,\"-\",L$1),База!$A:$G,6,0)),IF(ISERROR(VLOOKUP(CONCATENATE($B5,\"-\",L$1),'База выдачи'!$A:$F,6,0)),\"\",VLOOKUP(CONCATENATE($B5,\"-\",L$1),'База выдачи'!$A:$F,6,0)),VLOOKUP(CONCATENATE($B5,\"-\",L$1),База!$A:$G,6,0))","v":"02:29:35.460"},9,{"$f":"IF(ISERROR(VLOOKUP(CONCATENATE($B5,\"-\",O$1),База!$A:$G,5,0)),IF(ISERROR(VLOOKUP(CONCATENATE($B5,\"-\",O$1),'База выдачи'!$A:$F,5,0)),\"\",VLOOKUP(CONCATENATE($B5,\"-\",O$1),'База выдачи'!$A:$F,5,0)),VLOOKUP(CONCATENATE($B5,\"-\",O$1),База!$A:$G,5,0))","v":"OK"},{"$f":"IF(ISERROR(VLOOKUP(CONCATENATE($B5,\"-\",O$1),База!$A:$G,6,0)),IF(ISERROR(VLOOKUP(CONCATENATE($B5,\"-\",O$1),'База выдачи'!$A:$F,6,0)),\"\",VLOOKUP(CONCATENATE($B5,\"-\",O$1),'База выдачи'!$A:$F,6,0)),VLOOKUP(CONCATENATE($B5,\"-\",O$1),База!$A:$G,6,0))","v":"02:57:05.240"},8,{"$f":"IF(ISERROR(VLOOKUP(CONCATENATE($B5,\"-\",R$1),База!$A:$G,5,0)),IF(ISERROR(VLOOKUP(CONCATENATE($B5,\"-\",R$1),'База выдачи'!$A:$F,5,0)),\"\",VLOOKUP(CONCATENATE($B5,\"-\",R$1),'База выдачи'!$A:$F,5,0)),VLOOKUP(CONCATENATE($B5,\"-\",R$1),База!$A:$G,5,0))","v":"ST"},{"$f":"IF(ISERROR(VLOOKUP(CONCATENATE($B5,\"-\",R$1),База!$A:$G,6,0)),IF(ISERROR(VLOOKUP(CONCATENATE($B5,\"-\",R$1),'База выдачи'!$A:$F,6,0)),\"\",VLOOKUP(CONCATENATE($B5,\"-\",R$1),'База выдачи'!$A:$F,6,0)),VLOOKUP(CONCATENATE($B5,\"-\",R$1),База!$A:$G,6,0))","v":"02:57:07.180"},4,{"$f":"IF(ISERROR(VLOOKUP(CONCATENATE($B5,\"-\",U$1),База!$A:$G,5,0)),IF(ISERROR(VLOOKUP(CONCATENATE($B5,\"-\",U$1),'База выдачи'!$A:$F,5,0)),\"\",VLOOKUP(CONCATENATE($B5,\"-\",U$1),'База выдачи'!$A:$F,5,0)),VLOOKUP(CONCATENATE($B5,\"-\",U$1),База!$A:$G,5,0))","v":""},{"$f":"IF(ISERROR(VLOOKUP(CONCATENATE($B5,\"-\",U$1),База!$A:$G,6,0)),IF(ISERROR(VLOOKUP(CONCATENATE($B5,\"-\",U$1),'База выдачи'!$A:$F,6,0)),\"\",VLOOKUP(CONCATENATE($B5,\"-\",U$1),'База выдачи'!$A:$F,6,0)),VLOOKUP(CONCATENATE($B5,\"-\",U$1),База!$A:$G,6,0))","v":""},1,{"$f":"IF(ISERROR(VLOOKUP(CONCATENATE($B5,\"-\",X$1),База!$A:$G,5,0)),IF(ISERROR(VLOOKUP(CONCATENATE($B5,\"-\",X$1),'База выдачи'!$A:$F,5,0)),\"\",VLOOKUP(CONCATENATE($B5,\"-\",X$1),'База выдачи'!$A:$F,5,0)),VLOOKUP(CONCATENATE($B5,\"-\",X$1),База!$A:$G,5,0))","v":""},{"$f":"IF(ISERROR(VLOOKUP(CONCATENATE($B5,\"-\",X$1),База!$A:$G,6,0)),IF(ISERROR(VLOOKUP(CONCATENATE($B5,\"-\",X$1),'База выдачи'!$A:$F,6,0)),\"\",VLOOKUP(CONCATENATE($B5,\"-\",X$1),'База выдачи'!$A:$F,6,0)),VLOOKUP(CONCATENATE($B5,\"-\",X$1),База!$A:$G,6,0))","v":""},7,{"$f":"IF(ISERROR(VLOOKUP(CONCATENATE($B5,\"-\",AA$1),База!$A:$G,5,0)),IF(ISERROR(VLOOKUP(CONCATENATE($B5,\"-\",AA$1),'База выдачи'!$A:$F,5,0)),\"\",VLOOKUP(CONCATENATE($B5,\"-\",AA$1),'База выдачи'!$A:$F,5,0)),VLOOKUP(CONCATENATE($B5,\"-\",AA$1),База!$A:$G,5,0))","v":""},{"$f":"IF(ISERROR(VLOOKUP(CONCATENATE($B5,\"-\",AA$1),База!$A:$G,6,0)),IF(ISERROR(VLOOKUP(CONCATENATE($B5,\"-\",AA$1),'База выдачи'!$A:$F,6,0)),\"\",VLOOKUP(CONCATENATE($B5,\"-\",AA$1),'База выдачи'!$A:$F,6,0)),VLOOKUP(CONCATENATE($B5,\"-\",AA$1),База!$A:$G,6,0))","v":""},"H",{"$f":"IF(ISERROR(VLOOKUP(CONCATENATE($B5,\"-\",AD$1),База!$A:$G,5,0)),IF(ISERROR(VLOOKUP(CONCATENATE($B5,\"-\",AD$1),'База выдачи'!$A:$F,5,0)),\"\",VLOOKUP(CONCATENATE($B5,\"-\",AD$1),'База выдачи'!$A:$F,5,0)),VLOOKUP(CONCATENATE($B5,\"-\",AD$1),База!$A:$G,5,0))","v":""},{"$f":"IF(ISERROR(VLOOKUP(CONCATENATE($B5,\"-\",AD$1),База!$A:$G,6,0)),IF(ISERROR(VLOOKUP(CONCATENATE($B5,\"-\",AD$1),'База выдачи'!$A:$F,6,0)),\"\",VLOOKUP(CONCATENATE($B5,\"-\",AD$1),'База выдачи'!$A:$F,6,0)),VLOOKUP(CONCATENATE($B5,\"-\",AD$1),База!$A:$G,6,0))","v":""},"I",{"$f":"IF(ISERROR(VLOOKUP(CONCATENATE($B5,\"-\",AG$1),База!$A:$G,5,0)),IF(ISERROR(VLOOKUP(CONCATENATE($B5,\"-\",AG$1),'База выдачи'!$A:$F,5,0)),\"\",VLOOKUP(CONCATENATE($B5,\"-\",AG$1),'База выдачи'!$A:$F,5,0)),VLOOKUP(CONCATENATE($B5,\"-\",AG$1),База!$A:$G,5,0))","v":""},{"$f":"IF(ISERROR(VLOOKUP(CONCATENATE($B5,\"-\",AG$1),База!$A:$G,6,0)),IF(ISERROR(VLOOKUP(CONCATENATE($B5,\"-\",AG$1),'База выдачи'!$A:$F,6,0)),\"\",VLOOKUP(CONCATENATE($B5,\"-\",AG$1),'База выдачи'!$A:$F,6,0)),VLOOKUP(CONCATENATE($B5,\"-\",AG$1),База!$A:$G,6,0))","v":""},"J",{"$f":"IF(ISERROR(VLOOKUP(CONCATENATE($B5,\"-\",AJ$1),База!$A:$G,5,0)),IF(ISERROR(VLOOKUP(CONCATENATE($B5,\"-\",AJ$1),'База выдачи'!$A:$F,5,0)),\"\",VLOOKUP(CONCATENATE($B5,\"-\",AJ$1),'База выдачи'!$A:$F,5,0)),VLOOKUP(CONCATENATE($B5,\"-\",AJ$1),База!$A:$G,5,0))","v":""},{"$f":"IF(ISERROR(VLOOKUP(CONCATENATE($B5,\"-\",AJ$1),База!$A:$G,6,0)),IF(ISERROR(VLOOKUP(CONCATENATE($B5,\"-\",AJ$1),'База выдачи'!$A:$F,6,0)),\"\",VLOOKUP(CONCATENATE($B5,\"-\",AJ$1),'База выдачи'!$A:$F,6,0)),VLOOKUP(CONCATENATE($B5,\"-\",AJ$1),База!$A:$G,6,0))","v":""},"K",{"$f":"IF(ISERROR(VLOOKUP(CONCATENATE($B5,\"-\",AM$1),База!$A:$G,5,0)),IF(ISERROR(VLOOKUP(CONCATENATE($B5,\"-\",AM$1),'База выдачи'!$A:$F,5,0)),\"\",VLOOKUP(CONCATENATE($B5,\"-\",AM$1),'База выдачи'!$A:$F,5,0)),VLOOKUP(CONCATENATE($B5,\"-\",AM$1),База!$A:$G,5,0))","v":""},{"$f":"IF(ISERROR(VLOOKUP(CONCATENATE($B5,\"-\",AM$1),База!$A:$G,6,0)),IF(ISERROR(VLOOKUP(CONCATENATE($B5,\"-\",AM$1),'База выдачи'!$A:$F,6,0)),\"\",VLOOKUP(CONCATENATE($B5,\"-\",AM$1),'База выдачи'!$A:$F,6,0)),VLOOKUP(CONCATENATE($B5,\"-\",AM$1),База!$A:$G,6,0))","v":""},"L",{"$f":"IF(ISERROR(VLOOKUP(CONCATENATE($B5,\"-\",AP$1),База!$A:$G,5,0)),IF(ISERROR(VLOOKUP(CONCATENATE($B5,\"-\",AP$1),'База выдачи'!$A:$F,5,0)),\"\",VLOOKUP(CONCATENATE($B5,\"-\",AP$1),'База выдачи'!$A:$F,5,0)),VLOOKUP(CONCATENATE($B5,\"-\",AP$1),База!$A:$G,5,0))","v":""},{"$f":"IF(ISERROR(VLOOKUP(CONCATENATE($B5,\"-\",AP$1),База!$A:$G,6,0)),IF(ISERROR(VLOOKUP(CONCATENATE($B5,\"-\",AP$1),'База выдачи'!$A:$F,6,0)),\"\",VLOOKUP(CONCATENATE($B5,\"-\",AP$1),'База выдачи'!$A:$F,6,0)),VLOOKUP(CONCATENATE($B5,\"-\",AP$1),База!$A:$G,6,0))","v":""},"M",{"$f":"IF(ISERROR(VLOOKUP(CONCATENATE($B5,\"-\",AS$1),База!$A:$G,5,0)),IF(ISERROR(VLOOKUP(CONCATENATE($B5,\"-\",AS$1),'База выдачи'!$A:$F,5,0)),\"\",VLOOKUP(CONCATENATE($B5,\"-\",AS$1),'База выдачи'!$A:$F,5,0)),VLOOKUP(CONCATENATE($B5,\"-\",AS$1),База!$A:$G,5,0))","v":""},{"$f":"IF(ISERROR(VLOOKUP(CONCATENATE($B5,\"-\",AS$1),База!$A:$G,6,0)),IF(ISERROR(VLOOKUP(CONCATENATE($B5,\"-\",AS$1),'База выдачи'!$A:$F,6,0)),\"\",VLOOKUP(CONCATENATE($B5,\"-\",AS$1),'База выдачи'!$A:$F,6,0)),VLOOKUP(CONCATENATE($B5,\"-\",AS$1),База!$A:$G,6,0))","v":""},null,null,{"$f":"COUNTIFS(База!B:B,Статистика!B5,База!E:E,\"OK\")","v":3},{"$f":"BK3","v":"02:57:05.240"},10625,{"$f":"COUNTIFS(База!B:B,Статистика!B5,База!E:E,\"XXXX\")","v":2},{"$f":"IF(AX5+AZ5+BA5=0,ксекундвигре-BD5,ксекундвигре*Статистика!AX5+(ксекундвигре-Статистика!AZ5)+Статистика!BA5)","v":32817},78241,{"$f":"N(BD4)+1","v":3},9]
[4,{"$f":"IF(ISERROR(VLOOKUP(A6,Служебный!B:C,2,0)),\"\",A6&\"-\"&VLOOKUP(A6,Служебный!B:C,2,0))","v":"4-Страус"},4,{"$f":"IF(ISERROR(VLOOKUP(CONCATENATE($B6,\"-\",C$1),База!$A:$G,5,0)),IF(ISERROR(VLOOKUP(CONCATENATE($B6,\"-\",C$1),'База выдачи'!$A:$F,5,0)),\"\",VLOOKUP(CONCATENATE($B6,\"-\",C$1),'База выдачи'!$A:$F,5,0)),VLOOKUP(CONCATENATE($B6,\"-\",C$1),База!$A:$G,5,0))","v":"OK"},{"$f":"IF(ISERROR(VLOOKUP(CONCATENATE($B6,\"-\",C$1),База!$A:$G,6,0)),IF(ISERROR(VLOOKUP(CONCATENATE($B6,\"-\",C$1),'База выдачи'!$A:$F,6,0)),\"\",VLOOKUP(CONCATENATE($B6,\"-\",C$1),'База выдачи'!$A:$F,6,0)),VLOOKUP(CONCATENATE($B6,\"-\",C$1),База!$A:$G,6,0))","v":"00:49:48.060"},6,{"$f":"IF(ISERROR(VLOOKUP(CONCATENATE($B6,\"-\",F$1),База!$A:$G,5,0)),IF(ISERROR(VLOOKUP(CONCATENATE($B6,\"-\",F$1),'База выдачи'!$A:$F,5,0)),\"\",VLOOKUP(CONCATENATE($B6,\"-\",F$1),'База выдачи'!$A:$F,5,0)),VLOOKUP(CONCATENATE($B6,\"-\",F$1),База!$A:$G,5,0))","v":"OK"},{"$f":"IF(ISERROR(VLOOKUP(CONCATENATE($B6,\"-\",F$1),База!$A:$G,6,0)),IF(ISERROR(VLOOKUP(CONCATENATE($B6,\"-\",F$1),'База выдачи'!$A:$F,6,0)),\"\",VLOOKUP(CONCATENATE($B6,\"-\",F$1),'База выдачи'!$A:$F,6,0)),VLOOKUP(CONCATENATE($B6,\"-\",F$1),База!$A:$G,6,0))","v":"01:36:08.900"},1,{"$f":"IF(ISERROR(VLOOKUP(CONCATENATE($B6,\"-\",I$1),База!$A:$G,5,0)),IF(ISERROR(VLOOKUP(CONCATENATE($B6,\"-\",I$1),'База выдачи'!$A:$F,5,0)),\"\",VLOOKUP(CONCATENATE($B6,\"-\",I$1),'База выдачи'!$A:$F,5,0)),VLOOKUP(CONCATENATE($B6,\"-\",I$1),База!$A:$G,5,0))","v":"OK"},{"$f":"IF(ISERROR(VLOOKUP(CONCATENATE($B6,\"-\",I$1),База!$A:$G,6,0)),IF(ISERROR(VLOOKUP(CONCATENATE($B6,\"-\",I$1),'База выдачи'!$A:$F,6,0)),\"\",VLOOKUP(CONCATENATE($B6,\"-\",I$1),'База выдачи'!$A:$F,6,0)),VLOOKUP(CONCATENATE($B6,\"-\",I$1),База!$A:$G,6,0))","v":"01:50:54.140"},7,{"$f":"IF(ISERROR(VLOOKUP(CONCATENATE($B6,\"-\",L$1),База!$A:$G,5,0)),IF(ISERROR(VLOOKUP(CONCATENATE($B6,\"-\",L$1),'База выдачи'!$A:$F,5,0)),\"\",VLOOKUP(CONCATENATE($B6,\"-\",L$1),'База выдачи'!$A:$F,5,0)),VLOOKUP(CONCATENATE($B6,\"-\",L$1),База!$A:$G,5,0))","v":"OK"},{"$f":"IF(ISERROR(VLOOKUP(CONCATENATE($B6,\"-\",L$1),База!$A:$G,6,0)),IF(ISERROR(VLOOKUP(CONCATENATE($B6,\"-\",L$1),'База выдачи'!$A:$F,6,0)),\"\",VLOOKUP(CONCATENATE($B6,\"-\",L$1),'База выдачи'!$A:$F,6,0)),VLOOKUP(CONCATENATE($B6,\"-\",L$1),База!$A:$G,6,0))","v":"02:09:35.530"},8,{"$f":"IF(ISERROR(VLOOKUP(CONCATENATE($B6,\"-\",O$1),База!$A:$G,5,0)),IF(ISERROR(VLOOKUP(CONCATENATE($B6,\"-\",O$1),'База выдачи'!$A:$F,5,0)),\"\",VLOOKUP(CONCATENATE($B6,\"-\",O$1),'База выдачи'!$A:$F,5,0)),VLOOKUP(CONCATENATE($B6,\"-\",O$1),База!$A:$G,5,0))","v":"OK"},{"$f":"IF(ISERROR(VLOOKUP(CONCATENATE($B6,\"-\",O$1),База!$A:$G,6,0)),IF(ISERROR(VLOOKUP(CONCATENATE($B6,\"-\",O$1),'База выдачи'!$A:$F,6,0)),\"\",VLOOKUP(CONCATENATE($B6,\"-\",O$1),'База выдачи'!$A:$F,6,0)),VLOOKUP(CONCATENATE($B6,\"-\",O$1),База!$A:$G,6,0))","v":"02:33:47.750"},9,{"$f":"IF(ISERROR(VLOOKUP(CONCATENATE($B6,\"-\",R$1),База!$A:$G,5,0)),IF(ISERROR(VLOOKUP(CONCATENATE($B6,\"-\",R$1),'База выдачи'!$A:$F,5,0)),\"\",VLOOKUP(CONCATENATE($B6,\"-\",R$1),'База выдачи'!$A:$F,5,0)),VLOOKUP(CONCATENATE($B6,\"-\",R$1),База!$A:$G,5,0))","v":"OK"},{"$f":"IF(ISERROR(VLOOKUP(CONCATENATE($B6,\"-\",R$1),База!$A:$G,6,0)),IF(ISERROR(VLOOKUP(CONCATENATE($B6,\"-\",R$1),'База выдачи'!$A:$F,6,0)),\"\",VLOOKUP(CONCATENATE($B6,\"-\",R$1),'База выдачи'!$A:$F,6,0)),VLOOKUP(CONCATENATE($B6,\"-\",R$1),База!$A:$G,6,0))","v":"02:55:07.310"},5,{"$f":"IF(ISERROR(VLOOKUP(CONCATENATE($B6,\"-\",U$1),База!$A:$G,5,0)),IF(ISERROR(VLOOKUP(CONCATENATE($B6,\"-\",U$1),'База выдачи'!$A:$F,5,0)),\"\",VLOOKUP(CONCATENATE($B6,\"-\",U$1),'База выдачи'!$A:$F,5,0)),VLOOKUP(CONCATENATE($B6,\"-\",U$1),База!$A:$G,5,0))","v":"ST"},{"$f":"IF(ISERROR(VLOOKUP(CONCATENATE($B6,\"-\",U$1),База!$A:$G,6,0)),IF(ISERROR(VLOOKUP(CONCATENATE($B6,\"-\",U$1),'База выдачи'!$A:$F,6,0)),\"\",VLOOKUP(CONCATENATE($B6,\"-\",U$1),'База выдачи'!$A:$F,6,0)),VLOOKUP(CONCATENATE($B6,\"-\",U$1),База!$A:$G,6,0))","v":"02:55:09.210"},3,{"$f":"IF(ISERROR(VLOOKUP(CONCATENATE($B6,\"-\",X$1),База!$A:$G,5,0)),IF(ISERROR(VLOOKUP(CONCATENATE($B6,\"-\",X$1),'База выдачи'!$A:$F,5,0)),\"\",VLOOKUP(CONCATENATE($B6,\"-\",X$1),'База выдачи'!$A:$F,5,0)),VLOOKUP(CONCATENATE($B6,\"-\",X$1),База!$A:$G,5,0))","v":""},{"$f":"IF(ISERROR(VLOOKUP(CONCATENATE($B6,\"-\",X$1),База!$A:$G,6,0)),IF(ISERROR(VLOOKUP(CONCATENATE($B6,\"-\",X$1),'База выдачи'!$A:$F,6,0)),\"\",VLOOKUP(CONCATENATE($B6,\"-\",X$1),'База выдачи'!$A:$F,6,0)),VLOOKUP(CONCATENATE($B6,\"-\",X$1),База!$A:$G,6,0))","v":""},2,{"$f":"IF(ISERROR(VLOOKUP(CONCATENATE($B6,\"-\",AA$1),База!$A:$G,5,0)),IF(ISERROR(VLOOKUP(CONCATENATE($B6,\"-\",AA$1),'База выдачи'!$A:$F,5,0)),\"\",VLOOKUP(CONCATENATE($B6,\"-\",AA$1),'База выдачи'!$A:$F,5,0)),VLOOKUP(CONCATENATE($B6,\"-\",AA$1),База!$A:$G,5,0))","v":""},{"$f":"IF(ISERROR(VLOOKUP(CONCATENATE($B6,\"-\",AA$1),База!$A:$G,6,0)),IF(ISERROR(VLOOKUP(CONCATENATE($B6,\"-\",AA$1),'База выдачи'!$A:$F,6,0)),\"\",VLOOKUP(CONCATENATE($B6,\"-\",AA$1),'База выдачи'!$A:$F,6,0)),VLOOKUP(CONCATENATE($B6,\"-\",AA$1),База!$A:$G,6,0))","v":""},"G",{"$f":"IF(ISERROR(VLOOKUP(CONCATENATE($B6,\"-\",AD$1),База!$A:$G,5,0)),IF(ISERROR(VLOOKUP(CONCATENATE($B6,\"-\",AD$1),'База выдачи'!$A:$F,5,0)),\"\",VLOOKUP(CONCATENATE($B6,\"-\",AD$1),'База выдачи'!$A:$F,5,0)),VLOOKUP(CONCATENATE($B6,\"-\",AD$1),База!$A:$G,5,0))","v":""},{"$f":"IF(ISERROR(VLOOKUP(CONCATENATE($B6,\"-\",AD$1),База!$A:$G,6,0)),IF(ISERROR(VLOOKUP(CONCATENATE($B6,\"-\",AD$1),'База выдачи'!$A:$F,6,0)),\"\",VLOOKUP(CONCATENATE($B6,\"-\",AD$1),'База выдачи'!$A:$F,6,0)),VLOOKUP(CONCATENATE($B6,\"-\",AD$1),База!$A:$G,6,0))","v":""},"H",{"$f":"IF(ISERROR(VLOOKUP(CONCATENATE($B6,\"-\",AG$1),База!$A:$G,5,0)),IF(ISERROR(VLOOKUP(CONCATENATE($B6,\"-\",AG$1),'База выдачи'!$A:$F,5,0)),\"\",VLOOKUP(CONCATENATE($B6,\"-\",AG$1),'База выдачи'!$A:$F,5,0)),VLOOKUP(CONCATENATE($B6,\"-\",AG$1),База!$A:$G,5,0))","v":""},{"$f":"IF(ISERROR(VLOOKUP(CONCATENATE($B6,\"-\",AG$1),База!$A:$G,6,0)),IF(ISERROR(VLOOKUP(CONCATENATE($B6,\"-\",AG$1),'База выдачи'!$A:$F,6,0)),\"\",VLOOKUP(CONCATENATE($B6,\"-\",AG$1),'База выдачи'!$A:$F,6,0)),VLOOKUP(CONCATENATE($B6,\"-\",AG$1),База!$A:$G,6,0))","v":""},"I",{"$f":"IF(ISERROR(VLOOKUP(CONCATENATE($B6,\"-\",AJ$1),База!$A:$G,5,0)),IF(ISERROR(VLOOKUP(CONCATENATE($B6,\"-\",AJ$1),'База выдачи'!$A:$F,5,0)),\"\",VLOOKUP(CONCATENATE($B6,\"-\",AJ$1),'База выдачи'!$A:$F,5,0)),VLOOKUP(CONCATENATE($B6,\"-\",AJ$1),База!$A:$G,5,0))","v":""},{"$f":"IF(ISERROR(VLOOKUP(CONCATENATE($B6,\"-\",AJ$1),База!$A:$G,6,0)),IF(ISERROR(VLOOKUP(CONCATENATE($B6,\"-\",AJ$1),'База выдачи'!$A:$F,6,0)),\"\",VLOOKUP(CONCATENATE($B6,\"-\",AJ$1),'База выдачи'!$A:$F,6,0)),VLOOKUP(CONCATENATE($B6,\"-\",AJ$1),База!$A:$G,6,0))","v":""},"J",{"$f":"IF(ISERROR(VLOOKUP(CONCATENATE($B6,\"-\",AM$1),База!$A:$G,5,0)),IF(ISERROR(VLOOKUP(CONCATENATE($B6,\"-\",AM$1),'База выдачи'!$A:$F,5,0)),\"\",VLOOKUP(CONCATENATE($B6,\"-\",AM$1),'База выдачи'!$A:$F,5,0)),VLOOKUP(CONCATENATE($B6,\"-\",AM$1),База!$A:$G,5,0))","v":""},{"$f":"IF(ISERROR(VLOOKUP(CONCATENATE($B6,\"-\",AM$1),База!$A:$G,6,0)),IF(ISERROR(VLOOKUP(CONCATENATE($B6,\"-\",AM$1),'База выдачи'!$A:$F,6,0)),\"\",VLOOKUP(CONCATENATE($B6,\"-\",AM$1),'База выдачи'!$A:$F,6,0)),VLOOKUP(CONCATENATE($B6,\"-\",AM$1),База!$A:$G,6,0))","v":""},"K",{"$f":"IF(ISERROR(VLOOKUP(CONCATENATE($B6,\"-\",AP$1),База!$A:$G,5,0)),IF(ISERROR(VLOOKUP(CONCATENATE($B6,\"-\",AP$1),'База выдачи'!$A:$F,5,0)),\"\",VLOOKUP(CONCATENATE($B6,\"-\",AP$1),'База выдачи'!$A:$F,5,0)),VLOOKUP(CONCATENATE($B6,\"-\",AP$1),База!$A:$G,5,0))","v":""},{"$f":"IF(ISERROR(VLOOKUP(CONCATENATE($B6,\"-\",AP$1),База!$A:$G,6,0)),IF(ISERROR(VLOOKUP(CONCATENATE($B6,\"-\",AP$1),'База выдачи'!$A:$F,6,0)),\"\",VLOOKUP(CONCATENATE($B6,\"-\",AP$1),'База выдачи'!$A:$F,6,0)),VLOOKUP(CONCATENATE($B6,\"-\",AP$1),База!$A:$G,6,0))","v":""},"L",{"$f":"IF(ISERROR(VLOOKUP(CONCATENATE($B6,\"-\",AS$1),База!$A:$G,5,0)),IF(ISERROR(VLOOKUP(CONCATENATE($B6,\"-\",AS$1),'База выдачи'!$A:$F,5,0)),\"\",VLOOKUP(CONCATENATE($B6,\"-\",AS$1),'База выдачи'!$A:$F,5,0)),VLOOKUP(CONCATENATE($B6,\"-\",AS$1),База!$A:$G,5,0))","v":""},{"$f":"IF(ISERROR(VLOOKUP(CONCATENATE($B6,\"-\",AS$1),База!$A:$G,6,0)),IF(ISERROR(VLOOKUP(CONCATENATE($B6,\"-\",AS$1),'База выдачи'!$A:$F,6,0)),\"\",VLOOKUP(CONCATENATE($B6,\"-\",AS$1),'База выдачи'!$A:$F,6,0)),VLOOKUP(CONCATENATE($B6,\"-\",AS$1),База!$A:$G,6,0))","v":""},null,null,{"$f":"COUNTIFS(База!B:B,Статистика!B6,База!E:E,\"OK\")","v":6},{"$f":"BM3","v":"02:55:07.310"},10507,{"$f":"COUNTIFS(База!B:B,Статистика!B6,База!E:E,\"XXXX\")","v":0},{"$f":"IF(AX6+AZ6+BA6=0,ксекундвигре-BD6,ксекундвигре*Статистика!AX6+(ксекундвигре-Статистика!AZ6)+Статистика!BA6)","v":65513},66583,4,17]
[5,{"$f":"IF(ISERROR(VLOOKUP(A7,Служебный!B:C,2,0)),\"\",A7&\"-\"&VLOOKUP(A7,Служебный!B:C,2,0))","v":"5-Атом"},5,{"$f":"IF(ISERROR(VLOOKUP(CONCATENATE($B7,\"-\",C$1),База!$A:$G,5,0)),IF(ISERROR(VLOOKUP(CONCATENATE($B7,\"-\",C$1),'База выдачи'!$A:$F,5,0)),\"\",VLOOKUP(CONCATENATE($B7,\"-\",C$1),'База выдачи'!$A:$F,5,0)),VLOOKUP(CONCATENATE($B7,\"-\",C$1),База!$A:$G,5,0))","v":"XXXX"},{"$f":"IF(ISERROR(VLOOKUP(CONCATENATE($B7,\"-\",C$1),База!$A:$G,6,0)),IF(ISERROR(VLOOKUP(CONCATENATE($B7,\"-\",C$1),'База выдачи'!$A:$F,6,0)),\"\",VLOOKUP(CONCATENATE($B7,\"-\",C$1),'База выдачи'!$A:$F,6,0)),VLOOKUP(CONCATENATE($B7,\"-\",C$1),База!$A:$G,6,0))","v":"00:43:06.560"},2,{"$f":"IF(ISERROR(VLOOKUP(CONCATENATE($B7,\"-\",F$1),База!$A:$G,5,0)),IF(ISERROR(VLOOKUP(CONCATENATE($B7,\"-\",F$1),'База выдачи'!$A:$F,5,0)),\"\",VLOOKUP(CONCATENATE($B7,\"-\",F$1),'База выдачи'!$A:$F,5,0)),VLOOKUP(CONCATENATE($B7,\"-\",F$1),База!$A:$G,5,0))","v":"OK"},{"$f":"IF(ISERROR(VLOOKUP(CONCATENATE($B7,\"-\",F$1),База!$A:$G,6,0)),IF(ISERROR(VLOOKUP(CONCATENATE($B7,\"-\",F$1),'База выдачи'!$A:$F,6,0)),\"\",VLOOKUP(CONCATENATE($B7,\"-\",F$1),'База выдачи'!$A:$F,6,0)),VLOOKUP(CONCATENATE($B7,\"-\",F$1),База!$A:$G,6,0))","v":"01:06:09.840"},4,{"$f":"IF(ISERROR(VLOOKUP(CONCATENATE($B7,\"-\",I$1),База!$A:$G,5,0)),IF(ISERROR(VLOOKUP(CONCATENATE($B7,\"-\",I$1),'База выдачи'!$A:$F,5,0)),\"\",VLOOKUP(CONCATENATE($B7,\"-\",I$1),'База выдачи'!$A:$F,5,0)),VLOOKUP(CONCATENATE($B7,\"-\",I$1),База!$A:$G,5,0))","v":"OK"},{"$f":"IF(ISERROR(VLOOKUP(CONCATENATE($B7,\"-\",I$1),База!$A:$G,6,0)),IF(ISERROR(VLOOKUP(CONCATENATE($B7,\"-\",I$1),'База выдачи'!$A:$F,6,0)),\"\",VLOOKUP(CONCATENATE($B7,\"-\",I$1),'База выдачи'!$A:$F,6,0)),VLOOKUP(CONCATENATE($B7,\"-\",I$1),База!$A:$G,6,0))","v":"01:22:35.590"},8,{"$f":"IF(ISERROR(VLOOKUP(CONCATENATE($B7,\"-\",L$1),База!$A:$G,5,0)),IF(ISERROR(VLOOKUP(CONCATENATE($B7,\"-\",L$1),'База выдачи'!$A:$F,5,0)),\"\",VLOOKUP(CONCATENATE($B7,\"-\",L$1),'База выдачи'!$A:$F,5,0)),VLOOKUP(CONCATENATE($B7,\"-\",L$1),База!$A:$G,5,0))","v":"OK"},{"$f":"IF(ISERROR(VLOOKUP(CONCATENATE($B7,\"-\",L$1),База!$A:$G,6,0)),IF(ISERROR(VLOOKUP(CONCATENATE($B7,\"-\",L$1),'База выдачи'!$A:$F,6,0)),\"\",VLOOKUP(CONCATENATE($B7,\"-\",L$1),'База выдачи'!$A:$F,6,0)),VLOOKUP(CONCATENATE($B7,\"-\",L$1),База!$A:$G,6,0))","v":"01:37:42.060"},1,{"$f":"IF(ISERROR(VLOOKUP(CONCATENATE($B7,\"-\",O$1),База!$A:$G,5,0)),IF(ISERROR(VLOOKUP(CONCATENATE($B7,\"-\",O$1),'База выдачи'!$A:$F,5,0)),\"\",VLOOKUP(CONCATENATE($B7,\"-\",O$1),'База выдачи'!$A:$F,5,0)),VLOOKUP(CONCATENATE($B7,\"-\",O$1),База!$A:$G,5,0))","v":"XXXX"},{"$f":"IF(ISERROR(VLOOKUP(CONCATENATE($B7,\"-\",O$1),База!$A:$G,6,0)),IF(ISERROR(VLOOKUP(CONCATENATE($B7,\"-\",O$1),'База выдачи'!$A:$F,6,0)),\"\",VLOOKUP(CONCATENATE($B7,\"-\",O$1),'База выдачи'!$A:$F,6,0)),VLOOKUP(CONCATENATE($B7,\"-\",O$1),База!$A:$G,6,0))","v":"02:15:20.930"},3,{"$f":"IF(ISERROR(VLOOKUP(CONCATENATE($B7,\"-\",R$1),База!$A:$G,5,0)),IF(ISERROR(VLOOKUP(CONCATENATE($B7,\"-\",R$1),'База выдачи'!$A:$F,5,0)),\"\",VLOOKUP(CONCATENATE($B7,\"-\",R$1),'База выдачи'!$A:$F,5,0)),VLOOKUP(CONCATENATE($B7,\"-\",R$1),База!$A:$G,5,0))","v":"OK"},{"$f":"IF(ISERROR(VLOOKUP(CONCATENATE($B7,\"-\",R$1),База!$A:$G,6,0)),IF(ISERROR(VLOOKUP(CONCATENATE($B7,\"-\",R$1),'База выдачи'!$A:$F,6,0)),\"\",VLOOKUP(CONCATENATE($B7,\"-\",R$1),'База выдачи'!$A:$F,6,0)),VLOOKUP(CONCATENATE($B7,\"-\",R$1),База!$A:$G,6,0))","v":"02:26:37.560"},7,{"$f":"IF(ISERROR(VLOOKUP(CONCATENATE($B7,\"-\",U$1),База!$A:$G,5,0)),IF(ISERROR(VLOOKUP(CONCATENATE($B7,\"-\",U$1),'База выдачи'!$A:$F,5,0)),\"\",VLOOKUP(CONCATENATE($B7,\"-\",U$1),'База выдачи'!$A:$F,5,0)),VLOOKUP(CONCATENATE($B7,\"-\",U$1),База!$A:$G,5,0))","v":"OK"},{"$f":"IF(ISERROR(VLOOKUP(CONCATENATE($B7,\"-\",U$1),База!$A:$G,6,0)),IF(ISERROR(VLOOKUP(CONCATENATE($B7,\"-\",U$1),'База выдачи'!$A:$F,6,0)),\"\",VLOOKUP(CONCATENATE($B7,\"-\",U$1),'База выдачи'!$A:$F,6,0)),VLOOKUP(CONCATENATE($B7,\"-\",U$1),База!$A:$G,6,0))","v":"02:44:47.890"},9,{"$f":"IF(ISERROR(VLOOKUP(CONCATENATE($B7,\"-\",X$1),База!$A:$G,5,0)),IF(ISERROR(VLOOKUP(CONCATENATE($B7,\"-\",X$1),'База выдачи'!$A:$F,5,0)),\"\",VLOOKUP(CONCATENATE($B7,\"-\",X$1),'База выдачи'!$A:$F,5,0)),VLOOKUP(CONCATENATE($B7,\"-\",X$1),База!$A:$G,5,0))","v":"OK"},{"$f":"IF(ISERROR(VLOOKUP(CONCATENATE($B7,\"-\",X$1),База!$A:$G,6,0)),IF(ISERROR(VLOOKUP(CONCATENATE($B7,\"-\",X$1),'База выдачи'!$A:$F,6,0)),\"\",VLOOKUP(CONCATENATE($B7,\"-\",X$1),'База выдачи'!$A:$F,6,0)),VLOOKUP(CONCATENATE($B7,\"-\",X$1),База!$A:$G,6,0))","v":"02:56:24.590"},6,{"$f":"IF(ISERROR(VLOOKUP(CONCATENATE($B7,\"-\",AA$1),База!$A:$G,5,0)),IF(ISERROR(VLOOKUP(CONCATENATE($B7,\"-\",AA$1),'База выдачи'!$A:$F,5,0)),\"\",VLOOKUP(CONCATENATE($B7,\"-\",AA$1),'База выдачи'!$A:$F,5,0)),VLOOKUP(CONCATENATE($B7,\"-\",AA$1),База!$A:$G,5,0))","v":"ST"},{"$f":"IF(ISERROR(VLOOKUP(CONCATENATE($B7,\"-\",AA$1),База!$A:$G,6,0)),IF(ISERROR(VLOOKUP(CONCATENATE($B7,\"-\",AA$1),'База выдачи'!$A:$F,6,0)),\"\",VLOOKUP(CONCATENATE($B7,\"-\",AA$1),'База выдачи'!$A:$F,6,0)),VLOOKUP(CONCATENATE($B7,\"-\",AA$1),База!$A:$G,6,0))","v":"02:56:26.510"},"F",{"$f":"IF(ISERROR(VLOOKUP(CONCATENATE($B7,\"-\",AD$1),База!$A:$G,5,0)),IF(ISERROR(VLOOKUP(CONCATENATE($B7,\"-\",AD$1),'База выдачи'!$A:$F,5,0)),\"\",VLOOKUP(CONCATENATE($B7,\"-\",AD$1),'База выдачи'!$A:$F,5,0)),VLOOKUP(CONCATENATE($B7,\"-\",AD$1),База!$A:$G,5,0))","v":""},{"$f":"IF(ISERROR(VLOOKUP(CONCATENATE($B7,\"-\",AD$1),База!$A:$G,6,0)),IF(ISERROR(VLOOKUP(CONCATENATE($B7,\"-\",AD$1),'База выдачи'!$A:$F,6,0)),\"\",VLOOKUP(CONCATENATE($B7,\"-\",AD$1),'База выдачи'!$A:$F,6,0)),VLOOKUP(CONCATENATE($B7,\"-\",AD$1),База!$A:$G,6,0))","v":""},"G",{"$f":"IF(ISERROR(VLOOKUP(CONCATENATE($B7,\"-\",AG$1),База!$A:$G,5,0)),IF(ISERROR(VLOOKUP(CONCATENATE($B7,\"-\",AG$1),'База выдачи'!$A:$F,5,0)),\"\",VLOOKUP(CONCATENATE($B7,\"-\",AG$1),'База выдачи'!$A:$F,5,0)),VLOOKUP(CONCATENATE($B7,\"-\",AG$1),База!$A:$G,5,0))","v":""},{"$f":"IF(ISERROR(VLOOKUP(CONCATENATE($B7,\"-\",AG$1),База!$A:$G,6,0)),IF(ISERROR(VLOOKUP(CONCATENATE($B7,\"-\",AG$1),'База выдачи'!$A:$F,6,0)),\"\",VLOOKUP(CONCATENATE($B7,\"-\",AG$1),'База выдачи'!$A:$F,6,0)),VLOOKUP(CONCATENATE($B7,\"-\",AG$1),База!$A:$G,6,0))","v":""},"H",{"$f":"IF(ISERROR(VLOOKUP(CONCATENATE($B7,\"-\",AJ$1),База!$A:$G,5,0)),IF(ISERROR(VLOOKUP(CONCATENATE($B7,\"-\",AJ$1),'База выдачи'!$A:$F,5,0)),\"\",VLOOKUP(CONCATENATE($B7,\"-\",AJ$1),'База выдачи'!$A:$F,5,0)),VLOOKUP(CONCATENATE($B7,\"-\",AJ$1),База!$A:$G,5,0))","v":""},{"$f":"IF(ISERROR(VLOOKUP(CONCATENATE($B7,\"-\",AJ$1),База!$A:$G,6,0)),IF(ISERROR(VLOOKUP(CONCATENATE($B7,\"-\",AJ$1),'База выдачи'!$A:$F,6,0)),\"\",VLOOKUP(CONCATENATE($B7,\"-\",AJ$1),'База выдачи'!$A:$F,6,0)),VLOOKUP(CONCATENATE($B7,\"-\",AJ$1),База!$A:$G,6,0))","v":""},"I",{"$f":"IF(ISERROR(VLOOKUP(CONCATENATE($B7,\"-\",AM$1),База!$A:$G,5,0)),IF(ISERROR(VLOOKUP(CONCATENATE($B7,\"-\",AM$1),'База выдачи'!$A:$F,5,0)),\"\",VLOOKUP(CONCATENATE($B7,\"-\",AM$1),'База выдачи'!$A:$F,5,0)),VLOOKUP(CONCATENATE($B7,\"-\",AM$1),База!$A:$G,5,0))","v":""},{"$f":"IF(ISERROR(VLOOKUP(CONCATENATE($B7,\"-\",AM$1),База!$A:$G,6,0)),IF(ISERROR(VLOOKUP(CONCATENATE($B7,\"-\",AM$1),'База выдачи'!$A:$F,6,0)),\"\",VLOOKUP(CONCATENATE($B7,\"-\",AM$1),'База выдачи'!$A:$F,6,0)),VLOOKUP(CONCATENATE($B7,\"-\",AM$1),База!$A:$G,6,0))","v":""},"J",{"$f":"IF(ISERROR(VLOOKUP(CONCATENATE($B7,\"-\",AP$1),База!$A:$G,5,0)),IF(ISERROR(VLOOKUP(CONCATENATE($B7,\"-\",AP$1),'База выдачи'!$A:$F,5,0)),\"\",VLOOKUP(CONCATENATE($B7,\"-\",AP$1),'База выдачи'!$A:$F,5,0)),VLOOKUP(CONCATENATE($B7,\"-\",AP$1),База!$A:$G,5,0))","v":""},{"$f":"IF(ISERROR(VLOOKUP(CONCATENATE($B7,\"-\",AP$1),База!$A:$G,6,0)),IF(ISERROR(VLOOKUP(CONCATENATE($B7,\"-\",AP$1),'База выдачи'!$A:$F,6,0)),\"\",VLOOKUP(CONCATENATE($B7,\"-\",AP$1),'База выдачи'!$A:$F,6,0)),VLOOKUP(CONCATENATE($B7,\"-\",AP$1),База!$A:$G,6,0))","v":""},"K",{"$f":"IF(ISERROR(VLOOKUP(CONCATENATE($B7,\"-\",AS$1),База!$A:$G,5,0)),IF(ISERROR(VLOOKUP(CONCATENATE($B7,\"-\",AS$1),'База выдачи'!$A:$F,5,0)),\"\",VLOOKUP(CONCATENATE($B7,\"-\",AS$1),'База выдачи'!$A:$F,5,0)),VLOOKUP(CONCATENATE($B7,\"-\",AS$1),База!$A:$G,5,0))","v":""},{"$f":"IF(ISERROR(VLOOKUP(CONCATENATE($B7,\"-\",AS$1),База!$A:$G,6,0)),IF(ISERROR(VLOOKUP(CONCATENATE($B7,\"-\",AS$1),'База выдачи'!$A:$F,6,0)),\"\",VLOOKUP(CONCATENATE($B7,\"-\",AS$1),'База выдачи'!$A:$F,6,0)),VLOOKUP(CONCATENATE($B7,\"-\",AS$1),База!$A:$G,6,0))","v":""},null,null,{"$f":"COUNTIFS(База!B:B,Статистика!B7,База!E:E,\"OK\")","v":6},{"$f":"BO3","v":"02:56:24.590"},10585,{"$f":"COUNTIFS(База!B:B,Статистика!B7,База!E:E,\"XXXX\")","v":2},{"$f":"IF(AX7+AZ7+BA7=0,ксекундвигре-BD7,ксекундвигре*Статистика!AX7+(ксекундвигре-Статистика!AZ7)+Статистика!BA7)","v":65437},66392,5,18]
[6,{"$f":"IF(ISERROR(VLOOKUP(A8,Служебный!B:C,2,0)),\"\",A8&\"-\"&VLOOKUP(A8,Служебный!B:C,2,0))","v":"6-Уан Туз"},6,{"$f":"IF(ISERROR(VLOOKUP(CONCATENATE($B8,\"-\",C$1),База!$A:$G,5,0)),IF(ISERROR(VLOOKUP(CONCATENATE($B8,\"-\",C$1),'База выдачи'!$A:$F,5,0)),\"\",VLOOKUP(CONCATENATE($B8,\"-\",C$1),'База выдачи'!$A:$F,5,0)),VLOOKUP(CONCATENATE($B8,\"-\",C$1),База!$A:$G,5,0))","v":"XXXX"},{"$f":"IF(ISERROR(VLOOKUP(CONCATENATE($B8,\"-\",C$1),База!$A:$G,6,0)),IF(ISERROR(VLOOKUP(CONCATENATE($B8,\"-\",C$1),'База выдачи'!$A:$F,6,0)),\"\",VLOOKUP(CONCATENATE($B8,\"-\",C$1),'База выдачи'!$A:$F,6,0)),VLOOKUP(CONCATENATE($B8,\"-\",C$1),База!$A:$G,6,0))","v":"00:58:34.040"},1,{"$f":"IF(ISERROR(VLOOKUP(CONCATENATE($B8,\"-\",F$1),База!$A:$G,5,0)),IF(ISERROR(VLOOKUP(CONCATENATE($B8,\"-\",F$1),'База выдачи'!$A:$F,5,0)),\"\",VLOOKUP(CONCATENATE($B8,\"-\",F$1),'База выдачи'!$A:$F,5,0)),VLOOKUP(CONCATENATE($B8,\"-\",F$1),База!$A:$G,5,0))","v":"XXXX"},{"$f":"IF(ISERROR(VLOOKUP(CONCATENATE($B8,\"-\",F$1),База!$A:$G,6,0)),IF(ISERROR(VLOOKUP(CONCATENATE($B8,\"-\",F$1),'База выдачи'!$A:$F,6,0)),\"\",VLOOKUP(CONCATENATE($B8,\"-\",F$1),'База выдачи'!$A:$F,6,0)),VLOOKUP(CONCATENATE($B8,\"-\",F$1),База!$A:$G,6,0))","v":"01:42:13.080"},9,{"$f":"IF(ISERROR(VLOOKUP(CONCATENATE($B8,\"-\",I$1),База!$A:$G,5,0)),IF(ISERROR(VLOOKUP(CONCATENATE($B8,\"-\",I$1),'База выдачи'!$A:$F,5,0)),\"\",VLOOKUP(CONCATENATE($B8,\"-\",I$1),'База выдачи'!$A:$F,5,0)),VLOOKUP(CONCATENATE($B8,\"-\",I$1),База!$A:$G,5,0))","v":"OK"},{"$f":"IF(ISERROR(VLOOKUP(CONCATENATE($B8,\"-\",I$1),База!$A:$G,6,0)),IF(ISERROR(VLOOKUP(CONCATENATE($B8,\"-\",I$1),'База выдачи'!$A:$F,6,0)),\"\",VLOOKUP(CONCATENATE($B8,\"-\",I$1),'База выдачи'!$A:$F,6,0)),VLOOKUP(CONCATENATE($B8,\"-\",I$1),База!$A:$G,6,0))","v":"02:05:10.120"},3,{"$f":"IF(ISERROR(VLOOKUP(CONCATENATE($B8,\"-\",L$1),База!$A:$G,5,0)),IF(ISERROR(VLOOKUP(CONCATENATE($B8,\"-\",L$1),'База выдачи'!$A:$F,5,0)),\"\",VLOOKUP(CONCATENATE($B8,\"-\",L$1),'База выдачи'!$A:$F,5,0)),VLOOKUP(CONCATENATE($B8,\"-\",L$1),База!$A:$G,5,0))","v":"OK"},{"$f":"IF(ISERROR(VLOOKUP(CONCATENATE($B8,\"-\",L$1),База!$A:$G,6,0)),IF(ISERROR(VLOOKUP(CONCATENATE($B8,\"-\",L$1),'База выдачи'!$A:$F,6,0)),\"\",VLOOKUP(CONCATENATE($B8,\"-\",L$1),'База выдачи'!$A:$F,6,0)),VLOOKUP(CONCATENATE($B8,\"-\",L$1),База!$A:$G,6,0))","v":"02:20:40.800"},7,{"$f":"IF(ISERROR(VLOOKUP(CONCATENATE($B8,\"-\",O$1),База!$A:$G,5,0)),IF(ISERROR(VLOOKUP(CONCATENATE($B8,\"-\",O$1),'База выдачи'!$A:$F,5,0)),\"\",VLOOKUP(CONCATENATE($B8,\"-\",O$1),'База выдачи'!$A:$F,5,0)),VLOOKUP(CONCATENATE($B8,\"-\",O$1),База!$A:$G,5,0))","v":"OK"},{"$f":"IF(ISERROR(VLOOKUP(CONCATENATE($B8,\"-\",O$1),База!$A:$G,6,0)),IF(ISERROR(VLOOKUP(CONCATENATE($B8,\"-\",O$1),'База выдачи'!$A:$F,6,0)),\"\",VLOOKUP(CONCATENATE($B8,\"-\",O$1),'База выдачи'!$A:$F,6,0)),VLOOKUP(CONCATENATE($B8,\"-\",O$1),База!$A:$G,6,0))","v":"02:40:13.490"},4,{"$f":"IF(ISERROR(VLOOKUP(CONCATENATE($B8,\"-\",R$1),База!$A:$G,5,0)),IF(ISERROR(VLOOKUP(CONCATENATE($B8,\"-\",R$1),'База выдачи'!$A:$F,5,0)),\"\",VLOOKUP(CONCATENATE($B8,\"-\",R$1),'База выдачи'!$A:$F,5,0)),VLOOKUP(CONCATENATE($B8,\"-\",R$1),База!$A:$G,5,0))","v":"OK"},{"$f":"IF(ISERROR(VLOOKUP(CONCATENATE($B8,\"-\",R$1),База!$A:$G,6,0)),IF(ISERROR(VLOOKUP(CONCATENATE($B8,\"-\",R$1),'База выдачи'!$A:$F,6,0)),\"\",VLOOKUP(CONCATENATE($B8,\"-\",R$1),'База выдачи'!$A:$F,6,0)),VLOOKUP(CONCATENATE($B8,\"-\",R$1),База!$A:$G,6,0))","v":"02:54:57.520"},2,{"$f":"IF(ISERROR(VLOOKUP(CONCATENATE($B8,\"-\",U$1),База!$A:$G,5,0)),IF(ISERROR(VLOOKUP(CONCATENATE($B8,\"-\",U$1),'База выдачи'!$A:$F,5,0)),\"\",VLOOKUP(CONCATENATE($B8,\"-\",U$1),'База выдачи'!$A:$F,5,0)),VLOOKUP(CONCATENATE($B8,\"-\",U$1),База!$A:$G,5,0))","v":"OK"},{"$f":"IF(ISERROR(VLOOKUP(CONCATENATE($B8,\"-\",U$1),База!$A:$G,6,0)),IF(ISERROR(VLOOKUP(CONCATENATE($B8,\"-\",U$1),'База выдачи'!$A:$F,6,0)),\"\",VLOOKUP(CONCATENATE($B8,\"-\",U$1),'База выдачи'!$A:$F,6,0)),VLOOKUP(CONCATENATE($B8,\"-\",U$1),База!$A:$G,6,0))","v":"03:02:18.680"},5,{"$f":"IF(ISERROR(VLOOKUP(CONCATENATE($B8,\"-\",X$1),База!$A:$G,5,0)),IF(ISERROR(VLOOKUP(CONCATENATE($B8,\"-\",X$1),'База выдачи'!$A:$F,5,0)),\"\",VLOOKUP(CONCATENATE($B8,\"-\",X$1),'База выдачи'!$A:$F,5,0)),VLOOKUP(CONCATENATE($B8,\"-\",X$1),База!$A:$G,5,0))","v":"ST"},{"$f":"IF(ISERROR(VLOOKUP(CONCATENATE($B8,\"-\",X$1),База!$A:$G,6,0)),IF(ISERROR(VLOOKUP(CONCATENATE($B8,\"-\",X$1),'База выдачи'!$A:$F,6,0)),\"\",VLOOKUP(CONCATENATE($B8,\"-\",X$1),'База выдачи'!$A:$F,6,0)),VLOOKUP(CONCATENATE($B8,\"-\",X$1),База!$A:$G,6,0))","v":"03:02:20.580"},8,{"$f":"IF(ISERROR(VLOOKUP(CONCATENATE($B8,\"-\",AA$1),База!$A:$G,5,0)),IF(ISERROR(VLOOKUP(CONCATENATE($B8,\"-\",AA$1),'База выдачи'!$A:$F,5,0)),\"\",VLOOKUP(CONCATENATE($B8,\"-\",AA$1),'База выдачи'!$A:$F,5,0)),VLOOKUP(CONCATENATE($B8,\"-\",AA$1),База!$A:$G,5,0))","v":""},{"$f":"IF(ISERROR(VLOOKUP(CONCATENATE($B8,\"-\",AA$1),База!$A:$G,6,0)),IF(ISERROR(VLOOKUP(CONCATENATE($B8,\"-\",AA$1),'База выдачи'!$A:$F,6,0)),\"\",VLOOKUP(CONCATENATE($B8,\"-\",AA$1),'База выдачи'!$A:$F,6,0)),VLOOKUP(CONCATENATE($B8,\"-\",AA$1),База!$A:$G,6,0))","v":""},"E",{"$f":"IF(ISERROR(VLOOKUP(CONCATENATE($B8,\"-\",AD$1),База!$A:$G,5,0)),IF(ISERROR(VLOOKUP(CONCATENATE($B8,\"-\",AD$1),'База выдачи'!$A:$F,5,0)),\"\",VLOOKUP(CONCATENATE($B8,\"-\",AD$1),'База выдачи'!$A:$F,5,0)),VLOOKUP(CONCATENATE($B8,\"-\",AD$1),База!$A:$G,5,0))","v":""},{"$f":"IF(ISERROR(VLOOKUP(CONCATENATE($B8,\"-\",AD$1),База!$A:$G,6,0)),IF(ISERROR(VLOOKUP(CONCATENATE($B8,\"-\",AD$1),'База выдачи'!$A:$F,6,0)),\"\",VLOOKUP(CONCATENATE($B8,\"-\",AD$1),'База выдачи'!$A:$F,6,0)),VLOOKUP(CONCATENATE($B8,\"-\",AD$1),База!$A:$G,6,0))","v":""},"F",{"$f":"IF(ISERROR(VLOOKUP(CONCATENATE($B8,\"-\",AG$1),База!$A:$G,5,0)),IF(ISERROR(VLOOKUP(CONCATENATE($B8,\"-\",AG$1),'База выдачи'!$A:$F,5,0)),\"\",VLOOKUP(CONCATENATE($B8,\"-\",AG$1),'База выдачи'!$A:$F,5,0)),VLOOKUP(CONCATENATE($B8,\"-\",AG$1),База!$A:$G,5,0))","v":""},{"$f":"IF(ISERROR(VLOOKUP(CONCATENATE($B8,\"-\",AG$1),База!$A:$G,6,0)),IF(ISERROR(VLOOKUP(CONCATENATE($B8,\"-\",AG$1),'База выдачи'!$A:$F,6,0)),\"\",VLOOKUP(CONCATENATE($B8,\"-\",AG$1),'База выдачи'!$A:$F,6,0)),VLOOKUP(CONCATENATE($B8,\"-\",AG$1),База!$A:$G,6,0))","v":""},"G",{"$f":"IF(ISERROR(VLOOKUP(CONCATENATE($B8,\"-\",AJ$1),База!$A:$G,5,0)),IF(ISERROR(VLOOKUP(CONCATENATE($B8,\"-\",AJ$1),'База выдачи'!$A:$F,5,0)),\"\",VLOOKUP(CONCATENATE($B8,\"-\",AJ$1),'База выдачи'!$A:$F,5,0)),VLOOKUP(CONCATENATE($B8,\"-\",AJ$1),База!$A:$G,5,0))","v":""},{"$f":"IF(ISERROR(VLOOKUP(CONCATENATE($B8,\"-\",AJ$1),База!$A:$G,6,0)),IF(ISERROR(VLOOKUP(CONCATENATE($B8,\"-\",AJ$1),'База выдачи'!$A:$F,6,0)),\"\",VLOOKUP(CONCATENATE($B8,\"-\",AJ$1),'База выдачи'!$A:$F,6,0)),VLOOKUP(CONCATENATE($B8,\"-\",AJ$1),База!$A:$G,6,0))","v":""},"H",{"$f":"IF(ISERROR(VLOOKUP(CONCATENATE($B8,\"-\",AM$1),База!$A:$G,5,0)),IF(ISERROR(VLOOKUP(CONCATENATE($B8,\"-\",AM$1),'База выдачи'!$A:$F,5,0)),\"\",VLOOKUP(CONCATENATE($B8,\"-\",AM$1),'База выдачи'!$A:$F,5,0)),VLOOKUP(CONCATENATE($B8,\"-\",AM$1),База!$A:$G,5,0))","v":""},{"$f":"IF(ISERROR(VLOOKUP(CONCATENATE($B8,\"-\",AM$1),База!$A:$G,6,0)),IF(ISERROR(VLOOKUP(CONCATENATE($B8,\"-\",AM$1),'База выдачи'!$A:$F,6,0)),\"\",VLOOKUP(CONCATENATE($B8,\"-\",AM$1),'База выдачи'!$A:$F,6,0)),VLOOKUP(CONCATENATE($B8,\"-\",AM$1),База!$A:$G,6,0))","v":""},"I",{"$f":"IF(ISERROR(VLOOKUP(CONCATENATE($B8,\"-\",AP$1),База!$A:$G,5,0)),IF(ISERROR(VLOOKUP(CONCATENATE($B8,\"-\",AP$1),'База выдачи'!$A:$F,5,0)),\"\",VLOOKUP(CONCATENATE($B8,\"-\",AP$1),'База выдачи'!$A:$F,5,0)),VLOOKUP(CONCATENATE($B8,\"-\",AP$1),База!$A:$G,5,0))","v":""},{"$f":"IF(ISERROR(VLOOKUP(CONCATENATE($B8,\"-\",AP$1),База!$A:$G,6,0)),IF(ISERROR(VLOOKUP(CONCATENATE($B8,\"-\",AP$1),'База выдачи'!$A:$F,6,0)),\"\",VLOOKUP(CONCATENATE($B8,\"-\",AP$1),'База выдачи'!$A:$F,6,0)),VLOOKUP(CONCATENATE($B8,\"-\",AP$1),База!$A:$G,6,0))","v":""},"J",{"$f":"IF(ISERROR(VLOOKUP(CONCATENATE($B8,\"-\",AS$1),База!$A:$G,5,0)),IF(ISERROR(VLOOKUP(CONCATENATE($B8,\"-\",AS$1),'База выдачи'!$A:$F,5,0)),\"\",VLOOKUP(CONCATENATE($B8,\"-\",AS$1),'База выдачи'!$A:$F,5,0)),VLOOKUP(CONCATENATE($B8,\"-\",AS$1),База!$A:$G,5,0))","v":""},{"$f":"IF(ISERROR(VLOOKUP(CONCATENATE($B8,\"-\",AS$1),База!$A:$G,6,0)),IF(ISERROR(VLOOKUP(CONCATENATE($B8,\"-\",AS$1),'База выдачи'!$A:$F,6,0)),\"\",VLOOKUP(CONCATENATE($B8,\"-\",AS$1),'База выдачи'!$A:$F,6,0)),VLOOKUP(CONCATENATE($B8,\"-\",AS$1),База!$A:$G,6,0))","v":""},null,null,{"$f":"COUNTIFS(База!B:B,Статистика!B8,База!E:E,\"OK\")","v":5},{"$f":"BQ3","v":"03:02:18.680"},10939,{"$f":"COUNTIFS(База!B:B,Статистика!B8,База!E:E,\"XXXX\")","v":2},{"$f":"IF(AX8+AZ8+BA8=0,ксекундвигре-BD8,ксекундвигре*Статистика!AX8+(ксекундвигре-Статистика!AZ8)+Статистика!BA8)","v":54223},65660,6,13]
[7,{"$f":"IF(ISERROR(VLOOKUP(A9,Служебный!B:C,2,0)),\"\",A9&\"-\"&VLOOKUP(A9,Служебный!B:C,2,0))","v":"7-ПИОНЕРЫ"},7,{"$f":"IF(ISERROR(VLOOKUP(CONCATENATE($B9,\"-\",C$1),База!$A:$G,5,0)),IF(ISERROR(VLOOKUP(CONCATENATE($B9,\"-\",C$1),'База выдачи'!$A:$F,5,0)),\"\",VLOOKUP(CONCATENATE($B9,\"-\",C$1),'База выдачи'!$A:$F,5,0)),VLOOKUP(CONCATENATE($B9,\"-\",C$1),База!$A:$G,5,0))","v":"OK"},{"$f":"IF(ISERROR(VLOOKUP(CONCATENATE($B9,\"-\",C$1),База!$A:$G,6,0)),IF(ISERROR(VLOOKUP(CONCATENATE($B9,\"-\",C$1),'База выдачи'!$A:$F,6,0)),\"\",VLOOKUP(CONCATENATE($B9,\"-\",C$1),'База выдачи'!$A:$F,6,0)),VLOOKUP(CONCATENATE($B9,\"-\",C$1),База!$A:$G,6,0))","v":"02:12:34.680"},9,{"$f":"IF(ISERROR(VLOOKUP(CONCATENATE($B9,\"-\",F$1),База!$A:$G,5,0)),IF(ISERROR(VLOOKUP(CONCATENATE($B9,\"-\",F$1),'База выдачи'!$A:$F,5,0)),\"\",VLOOKUP(CONCATENATE($B9,\"-\",F$1),'База выдачи'!$A:$F,5,0)),VLOOKUP(CONCATENATE($B9,\"-\",F$1),База!$A:$G,5,0))","v":"OK"},{"$f":"IF(ISERROR(VLOOKUP(CONCATENATE($B9,\"-\",F$1),База!$A:$G,6,0)),IF(ISERROR(VLOOKUP(CONCATENATE($B9,\"-\",F$1),'База выдачи'!$A:$F,6,0)),\"\",VLOOKUP(CONCATENATE($B9,\"-\",F$1),'База выдачи'!$A:$F,6,0)),VLOOKUP(CONCATENATE($B9,\"-\",F$1),База!$A:$G,6,0))","v":"02:13:01.450"},8,{"$f":"IF(ISERROR(VLOOKUP(CONCATENATE($B9,\"-\",I$1),База!$A:$G,5,0)),IF(ISERROR(VLOOKUP(CONCATENATE($B9,\"-\",I$1),'База выдачи'!$A:$F,5,0)),\"\",VLOOKUP(CONCATENATE($B9,\"-\",I$1),'База выдачи'!$A:$F,5,0)),VLOOKUP(CONCATENATE($B9,\"-\",I$1),База!$A:$G,5,0))","v":"OK"},{"$f":"IF(ISERROR(VLOOKUP(CONCATENATE($B9,\"-\",I$1),База!$A:$G,6,0)),IF(ISERROR(VLOOKUP(CONCATENATE($B9,\"-\",I$1),'База выдачи'!$A:$F,6,0)),\"\",VLOOKUP(CONCATENATE($B9,\"-\",I$1),'База выдачи'!$A:$F,6,0)),VLOOKUP(CONCATENATE($B9,\"-\",I$1),База!$A:$G,6,0))","v":"02:34:54.090"},1,{"$f":"IF(ISERROR(VLOOKUP(CONCATENATE($B9,\"-\",L$1),База!$A:$G,5,0)),IF(ISERROR(VLOOKUP(CONCATENATE($B9,\"-\",L$1),'База выдачи'!$A:$F,5,0)),\"\",VLOOKUP(CONCATENATE($B9,\"-\",L$1),'База выдачи'!$A:$F,5,0)),VLOOKUP(CONCATENATE($B9,\"-\",L$1),База!$A:$G,5,0))","v":"OK"},{"$f":"IF(ISERROR(VLOOKUP(CONCATENATE($B9,\"-\",L$1),База!$A:$G,6,0)),IF(ISERROR(VLOOKUP(CONCATENATE($B9,\"-\",L$1),'База выдачи'!$A:$F,6,0)),\"\",VLOOKUP(CONCATENATE($B9,\"-\",L$1),'База выдачи'!$A:$F,6,0)),VLOOKUP(CONCATENATE($B9,\"-\",L$1),База!$A:$G,6,0))","v":"02:13:16.780"},3,{"$f":"IF(ISERROR(VLOOKUP(CONCATENATE($B9,\"-\",O$1),База!$A:$G,5,0)),IF(ISERROR(VLOOKUP(CONCATENATE($B9,\"-\",O$1),'База выдачи'!$A:$F,5,0)),\"\",VLOOKUP(CONCATENATE($B9,\"-\",O$1),'База выдачи'!$A:$F,5,0)),VLOOKUP(CONCATENATE($B9,\"-\",O$1),База!$A:$G,5,0))","v":"ST"},{"$f":"IF(ISERROR(VLOOKUP(CONCATENATE($B9,\"-\",O$1),База!$A:$G,6,0)),IF(ISERROR(VLOOKUP(CONCATENATE($B9,\"-\",O$1),'База выдачи'!$A:$F,6,0)),\"\",VLOOKUP(CONCATENATE($B9,\"-\",O$1),'База выдачи'!$A:$F,6,0)),VLOOKUP(CONCATENATE($B9,\"-\",O$1),База!$A:$G,6,0))","v":"02:34:56.010"},5,{"$f":"IF(ISERROR(VLOOKUP(CONCATENATE($B9,\"-\",R$1),База!$A:$G,5,0)),IF(ISERROR(VLOOKUP(CONCATENATE($B9,\"-\",R$1),'База выдачи'!$A:$F,5,0)),\"\",VLOOKUP(CONCATENATE($B9,\"-\",R$1),'База выдачи'!$A:$F,5,0)),VLOOKUP(CONCATENATE($B9,\"-\",R$1),База!$A:$G,5,0))","v":"ST"},{"$f":"IF(ISERROR(VLOOKUP(CONCATENATE($B9,\"-\",R$1),База!$A:$G,6,0)),IF(ISERROR(VLOOKUP(CONCATENATE($B9,\"-\",R$1),'База выдачи'!$A:$F,6,0)),\"\",VLOOKUP(CONCATENATE($B9,\"-\",R$1),'База выдачи'!$A:$F,6,0)),VLOOKUP(CONCATENATE($B9,\"-\",R$1),База!$A:$G,6,0))","v":"22:05:13.470"},6,{"$f":"IF(ISERROR(VLOOKUP(CONCATENATE($B9,\"-\",U$1),База!$A:$G,5,0)),IF(ISERROR(VLOOKUP(CONCATENATE($B9,\"-\",U$1),'База выдачи'!$A:$F,5,0)),\"\",VLOOKUP(CONCATENATE($B9,\"-\",U$1),'База выдачи'!$A:$F,5,0)),VLOOKUP(CONCATENATE($B9,\"-\",U$1),База!$A:$G,5,0))","v":""},{"$f":"IF(ISERROR(VLOOKUP(CONCATENATE($B9,\"-\",U$1),База!$A:$G,6,0)),IF(ISERROR(VLOOKUP(CONCATENATE($B9,\"-\",U$1),'База выдачи'!$A:$F,6,0)),\"\",VLOOKUP(CONCATENATE($B9,\"-\",U$1),'База выдачи'!$A:$F,6,0)),VLOOKUP(CONCATENATE($B9,\"-\",U$1),База!$A:$G,6,0))","v":""},2,{"$f":"IF(ISERROR(VLOOKUP(CONCATENATE($B9,\"-\",X$1),База!$A:$G,5,0)),IF(ISERROR(VLOOKUP(CONCATENATE($B9,\"-\",X$1),'База выдачи'!$A:$F,5,0)),\"\",VLOOKUP(CONCATENATE($B9,\"-\",X$1),'База выдачи'!$A:$F,5,0)),VLOOKUP(CONCATENATE($B9,\"-\",X$1),База!$A:$G,5,0))","v":""},{"$f":"IF(ISERROR(VLOOKUP(CONCATENATE($B9,\"-\",X$1),База!$A:$G,6,0)),IF(ISERROR(VLOOKUP(CONCATENATE($B9,\"-\",X$1),'База выдачи'!$A:$F,6,0)),\"\",VLOOKUP(CONCATENATE($B9,\"-\",X$1),'База выдачи'!$A:$F,6,0)),VLOOKUP(CONCATENATE($B9,\"-\",X$1),База!$A:$G,6,0))","v":""},4,{"$f":"IF(ISERROR(VLOOKUP(CONCATENATE($B9,\"-\",AA$1),База!$A:$G,5,0)),IF(ISERROR(VLOOKUP(CONCATENATE($B9,\"-\",AA$1),'База выдачи'!$A:$F,5,0)),\"\",VLOOKUP(CONCATENATE($B9,\"-\",AA$1),'База выдачи'!$A:$F,5,0)),VLOOKUP(CONCATENATE($B9,\"-\",AA$1),База!$A:$G,5,0))","v":""},{"$f":"IF(ISERROR(VLOOKUP(CONCATENATE($B9,\"-\",AA$1),База!$A:$G,6,0)),IF(ISERROR(VLOOKUP(CONCATENATE($B9,\"-\",AA$1),'База выдачи'!$A:$F,6,0)),\"\",VLOOKUP(CONCATENATE($B9,\"-\",AA$1),'База выдачи'!$A:$F,6,0)),VLOOKUP(CONCATENATE($B9,\"-\",AA$1),База!$A:$G,6,0))","v":""},"D",{"$f":"IF(ISERROR(VLOOKUP(CONCATENATE($B9,\"-\",AD$1),База!$A:$G,5,0)),IF(ISERROR(VLOOKUP(CONCATENATE($B9,\"-\",AD$1),'База выдачи'!$A:$F,5,0)),\"\",VLOOKUP(CONCATENATE($B9,\"-\",AD$1),'База выдачи'!$A:$F,5,0)),VLOOKUP(CONCATENATE($B9,\"-\",AD$1),База!$A:$G,5,0))","v":""},{"$f":"IF(ISERROR(VLOOKUP(CONCATENATE($B9,\"-\",AD$1),База!$A:$G,6,0)),IF(ISERROR(VLOOKUP(CONCATENATE($B9,\"-\",AD$1),'База выдачи'!$A:$F,6,0)),\"\",VLOOKUP(CONCATENATE($B9,\"-\",AD$1),'База выдачи'!$A:$F,6,0)),VLOOKUP(CONCATENATE($B9,\"-\",AD$1),База!$A:$G,6,0))","v":""},"E",{"$f":"IF(ISERROR(VLOOKUP(CONCATENATE($B9,\"-\",AG$1),База!$A:$G,5,0)),IF(ISERROR(VLOOKUP(CONCATENATE($B9,\"-\",AG$1),'База выдачи'!$A:$F,5,0)),\"\",VLOOKUP(CONCATENATE($B9,\"-\",AG$1),'База выдачи'!$A:$F,5,0)),VLOOKUP(CONCATENATE($B9,\"-\",AG$1),База!$A:$G,5,0))","v":""},{"$f":"IF(ISERROR(VLOOKUP(CONCATENATE($B9,\"-\",AG$1),База!$A:$G,6,0)),IF(ISERROR(VLOOKUP(CONCATENATE($B9,\"-\",AG$1),'База выдачи'!$A:$F,6,0)),\"\",VLOOKUP(CONCATENATE($B9,\"-\",AG$1),'База выдачи'!$A:$F,6,0)),VLOOKUP(CONCATENATE($B9,\"-\",AG$1),База!$A:$G,6,0))","v":""},"F",{"$f":"IF(ISERROR(VLOOKUP(CONCATENATE($B9,\"-\",AJ$1),База!$A:$G,5,0)),IF(ISERROR(VLOOKUP(CONCATENATE($B9,\"-\",AJ$1),'База выдачи'!$A:$F,5,0)),\"\",VLOOKUP(CONCATENATE($B9,\"-\",AJ$1),'База выдачи'!$A:$F,5,0)),VLOOKUP(CONCATENATE($B9,\"-\",AJ$1),База!$A:$G,5,0))","v":""},{"$f":"IF(ISERROR(VLOOKUP(CONCATENATE($B9,\"-\",AJ$1),База!$A:$G,6,0)),IF(ISERROR(VLOOKUP(CONCATENATE($B9,\"-\",AJ$1),'База выдачи'!$A:$F,6,0)),\"\",VLOOKUP(CONCATENATE($B9,\"-\",AJ$1),'База выдачи'!$A:$F,6,0)),VLOOKUP(CONCATENATE($B9,\"-\",AJ$1),База!$A:$G,6,0))","v":""},"G",{"$f":"IF(ISERROR(VLOOKUP(CONCATENATE($B9,\"-\",AM$1),База!$A:$G,5,0)),IF(ISERROR(VLOOKUP(CONCATENATE($B9,\"-\",AM$1),'База выдачи'!$A:$F,5,0)),\"\",VLOOKUP(CONCATENATE($B9,\"-\",AM$1),'База выдачи'!$A:$F,5,0)),VLOOKUP(CONCATENATE($B9,\"-\",AM$1),База!$A:$G,5,0))","v":""},{"$f":"IF(ISERROR(VLOOKUP(CONCATENATE($B9,\"-\",AM$1),База!$A:$G,6,0)),IF(ISERROR(VLOOKUP(CONCATENATE($B9,\"-\",AM$1),'База выдачи'!$A:$F,6,0)),\"\",VLOOKUP(CONCATENATE($B9,\"-\",AM$1),'База выдачи'!$A:$F,6,0)),VLOOKUP(CONCATENATE($B9,\"-\",AM$1),База!$A:$G,6,0))","v":""},"H",{"$f":"IF(ISERROR(VLOOKUP(CONCATENATE($B9,\"-\",AP$1),База!$A:$G,5,0)),IF(ISERROR(VLOOKUP(CONCATENATE($B9,\"-\",AP$1),'База выдачи'!$A:$F,5,0)),\"\",VLOOKUP(CONCATENATE($B9,\"-\",AP$1),'База выдачи'!$A:$F,5,0)),VLOOKUP(CONCATENATE($B9,\"-\",AP$1),База!$A:$G,5,0))","v":""},{"$f":"IF(ISERROR(VLOOKUP(CONCATENATE($B9,\"-\",AP$1),База!$A:$G,6,0)),IF(ISERROR(VLOOKUP(CONCATENATE($B9,\"-\",AP$1),'База выдачи'!$A:$F,6,0)),\"\",VLOOKUP(CONCATENATE($B9,\"-\",AP$1),'База выдачи'!$A:$F,6,0)),VLOOKUP(CONCATENATE($B9,\"-\",AP$1),База!$A:$G,6,0))","v":""},"I",{"$f":"IF(ISERROR(VLOOKUP(CONCATENATE($B9,\"-\",AS$1),База!$A:$G,5,0)),IF(ISERROR(VLOOKUP(CONCATENATE($B9,\"-\",AS$1),'База выдачи'!$A:$F,5,0)),\"\",VLOOKUP(CONCATENATE($B9,\"-\",AS$1),'База выдачи'!$A:$F,5,0)),VLOOKUP(CONCATENATE($B9,\"-\",AS$1),База!$A:$G,5,0))","v":""},{"$f":"IF(ISERROR(VLOOKUP(CONCATENATE($B9,\"-\",AS$1),База!$A:$G,6,0)),IF(ISERROR(VLOOKUP(CONCATENATE($B9,\"-\",AS$1),'База выдачи'!$A:$F,6,0)),\"\",VLOOKUP(CONCATENATE($B9,\"-\",AS$1),'База выдачи'!$A:$F,6,0)),VLOOKUP(CONCATENATE($B9,\"-\",AS$1),База!$A:$G,6,0))","v":""},null,null,{"$f":"COUNTIFS(База!B:B,Статистика!B9,База!E:E,\"OK\")","v":4},{"$f":"BS3","v":"02:34:54.090"},9294,{"$f":"COUNTIFS(База!B:B,Статистика!B9,База!E:E,\"XXXX\")","v":0},{"$f":"IF(AX9+AZ9+BA9=0,ксекундвигре-BD9,ксекундвигре*Статистика!AX9+(ксекундвигре-Статистика!AZ9)+Статистика!BA9)","v":45006},65513,7,4]
[8,{"$f":"IF(ISERROR(VLOOKUP(A10,Служебный!B:C,2,0)),\"\",A10&\"-\"&VLOOKUP(A10,Служебный!B:C,2,0))","v":"8-Корпорация счастья"},8,{"$f":"IF(ISERROR(VLOOKUP(CONCATENATE($B10,\"-\",C$1),База!$A:$G,5,0)),IF(ISERROR(VLOOKUP(CONCATENATE($B10,\"-\",C$1),'База выдачи'!$A:$F,5,0)),\"\",VLOOKUP(CONCATENATE($B10,\"-\",C$1),'База выдачи'!$A:$F,5,0)),VLOOKUP(CONCATENATE($B10,\"-\",C$1),База!$A:$G,5,0))","v":"OK"},{"$f":"IF(ISERROR(VLOOKUP(CONCATENATE($B10,\"-\",C$1),База!$A:$G,6,0)),IF(ISERROR(VLOOKUP(CONCATENATE($B10,\"-\",C$1),'База выдачи'!$A:$F,6,0)),\"\",VLOOKUP(CONCATENATE($B10,\"-\",C$1),'База выдачи'!$A:$F,6,0)),VLOOKUP(CONCATENATE($B10,\"-\",C$1),База!$A:$G,6,0))","v":"00:25:26.230"},7,{"$f":"IF(ISERROR(VLOOKUP(CONCATENATE($B10,\"-\",F$1),База!$A:$G,5,0)),IF(ISERROR(VLOOKUP(CONCATENATE($B10,\"-\",F$1),'База выдачи'!$A:$F,5,0)),\"\",VLOOKUP(CONCATENATE($B10,\"-\",F$1),'База выдачи'!$A:$F,5,0)),VLOOKUP(CONCATENATE($B10,\"-\",F$1),База!$A:$G,5,0))","v":"OK"},{"$f":"IF(ISERROR(VLOOKUP(CONCATENATE($B10,\"-\",F$1),База!$A:$G,6,0)),IF(ISERROR(VLOOKUP(CONCATENATE($B10,\"-\",F$1),'База выдачи'!$A:$F,6,0)),\"\",VLOOKUP(CONCATENATE($B10,\"-\",F$1),'База выдачи'!$A:$F,6,0)),VLOOKUP(CONCATENATE($B10,\"-\",F$1),База!$A:$G,6,0))","v":"00:44:49.080"},6,{"$f":"IF(ISERROR(VLOOKUP(CONCATENATE($B10,\"-\",I$1),База!$A:$G,5,0)),IF(ISERROR(VLOOKUP(CONCATENATE($B10,\"-\",I$1),'База выдачи'!$A:$F,5,0)),\"\",VLOOKUP(CONCATENATE($B10,\"-\",I$1),'База выдачи'!$A:$F,5,0)),VLOOKUP(CONCATENATE($B10,\"-\",I$1),База!$A:$G,5,0))","v":"XXXX"},{"$f":"IF(ISERROR(VLOOKUP(CONCATENATE($B10,\"-\",I$1),База!$A:$G,6,0)),IF(ISERROR(VLOOKUP(CONCATENATE($B10,\"-\",I$1),'База выдачи'!$A:$F,6,0)),\"\",VLOOKUP(CONCATENATE($B10,\"-\",I$1),'База выдачи'!$A:$F,6,0)),VLOOKUP(CONCATENATE($B10,\"-\",I$1),База!$A:$G,6,0))","v":"01:31:08.630"},9,{"$f":"IF(ISERROR(VLOOKUP(CONCATENATE($B10,\"-\",L$1),База!$A:$G,5,0)),IF(ISERROR(VLOOKUP(CONCATENATE($B10,\"-\",L$1),'База выдачи'!$A:$F,5,0)),\"\",VLOOKUP(CONCATENATE($B10,\"-\",L$1),'База выдачи'!$A:$F,5,0)),VLOOKUP(CONCATENATE($B10,\"-\",L$1),База!$A:$G,5,0))","v":"OK"},{"$f":"IF(ISERROR(VLOOKUP(CONCATENATE($B10,\"-\",L$1),База!$A:$G,6,0)),IF(ISERROR(VLOOKUP(CONCATENATE($B10,\"-\",L$1),'База выдачи'!$A:$F,6,0)),\"\",VLOOKUP(CONCATENATE($B10,\"-\",L$1),'База выдачи'!$A:$F,6,0)),VLOOKUP(CONCATENATE($B10,\"-\",L$1),База!$A:$G,6,0))","v":"01:43:40.380"},5,{"$f":"IF(ISERROR(VLOOKUP(CONCATENATE($B10,\"-\",O$1),База!$A:$G,5,0)),IF(ISERROR(VLOOKUP(CONCATENATE($B10,\"-\",O$1),'База выдачи'!$A:$F,5,0)),\"\",VLOOKUP(CONCATENATE($B10,\"-\",O$1),'База выдачи'!$A:$F,5,0)),VLOOKUP(CONCATENATE($B10,\"-\",O$1),База!$A:$G,5,0))","v":"OK"},{"$f":"IF(ISERROR(VLOOKUP(CONCATENATE($B10,\"-\",O$1),База!$A:$G,6,0)),IF(ISERROR(VLOOKUP(CONCATENATE($B10,\"-\",O$1),'База выдачи'!$A:$F,6,0)),\"\",VLOOKUP(CONCATENATE($B10,\"-\",O$1),'База выдачи'!$A:$F,6,0)),VLOOKUP(CONCATENATE($B10,\"-\",O$1),База!$A:$G,6,0))","v":"01:59:13.270"},2,{"$f":"IF(ISERROR(VLOOKUP(CONCATENATE($B10,\"-\",R$1),База!$A:$G,5,0)),IF(ISERROR(VLOOKUP(CONCATENATE($B10,\"-\",R$1),'База выдачи'!$A:$F,5,0)),\"\",VLOOKUP(CONCATENATE($B10,\"-\",R$1),'База выдачи'!$A:$F,5,0)),VLOOKUP(CONCATENATE($B10,\"-\",R$1),База!$A:$G,5,0))","v":"OK"},{"$f":"IF(ISERROR(VLOOKUP(CONCATENATE($B10,\"-\",R$1),База!$A:$G,6,0)),IF(ISERROR(VLOOKUP(CONCATENATE($B10,\"-\",R$1),'База выдачи'!$A:$F,6,0)),\"\",VLOOKUP(CONCATENATE($B10,\"-\",R$1),'База выдачи'!$A:$F,6,0)),VLOOKUP(CONCATENATE($B10,\"-\",R$1),База!$A:$G,6,0))","v":"02:38:28.780"},1,{"$f":"IF(ISERROR(VLOOKUP(CONCATENATE($B10,\"-\",U$1),База!$A:$G,5,0)),IF(ISERROR(VLOOKUP(CONCATENATE($B10,\"-\",U$1),'База выдачи'!$A:$F,5,0)),\"\",VLOOKUP(CONCATENATE($B10,\"-\",U$1),'База выдачи'!$A:$F,5,0)),VLOOKUP(CONCATENATE($B10,\"-\",U$1),База!$A:$G,5,0))","v":"ST"},{"$f":"IF(ISERROR(VLOOKUP(CONCATENATE($B10,\"-\",U$1),База!$A:$G,6,0)),IF(ISERROR(VLOOKUP(CONCATENATE($B10,\"-\",U$1),'База выдачи'!$A:$F,6,0)),\"\",VLOOKUP(CONCATENATE($B10,\"-\",U$1),'База выдачи'!$A:$F,6,0)),VLOOKUP(CONCATENATE($B10,\"-\",U$1),База!$A:$G,6,0))","v":"02:38:30.670"},4,{"$f":"IF(ISERROR(VLOOKUP(CONCATENATE($B10,\"-\",X$1),База!$A:$G,5,0)),IF(ISERROR(VLOOKUP(CONCATENATE($B10,\"-\",X$1),'База выдачи'!$A:$F,5,0)),\"\",VLOOKUP(CONCATENATE($B10,\"-\",X$1),'База выдачи'!$A:$F,5,0)),VLOOKUP(CONCATENATE($B10,\"-\",X$1),База!$A:$G,5,0))","v":""},{"$f":"IF(ISERROR(VLOOKUP(CONCATENATE($B10,\"-\",X$1),База!$A:$G,6,0)),IF(ISERROR(VLOOKUP(CONCATENATE($B10,\"-\",X$1),'База выдачи'!$A:$F,6,0)),\"\",VLOOKUP(CONCATENATE($B10,\"-\",X$1),'База выдачи'!$A:$F,6,0)),VLOOKUP(CONCATENATE($B10,\"-\",X$1),База!$A:$G,6,0))","v":""},3,{"$f":"IF(ISERROR(VLOOKUP(CONCATENATE($B10,\"-\",AA$1),База!$A:$G,5,0)),IF(ISERROR(VLOOKUP(CONCATENATE($B10,\"-\",AA$1),'База выдачи'!$A:$F,5,0)),\"\",VLOOKUP(CONCATENATE($B10,\"-\",AA$1),'База выдачи'!$A:$F,5,0)),VLOOKUP(CONCATENATE($B10,\"-\",AA$1),База!$A:$G,5,0))","v":""},{"$f":"IF(ISERROR(VLOOKUP(CONCATENATE($B10,\"-\",AA$1),База!$A:$G,6,0)),IF(ISERROR(VLOOKUP(CONCATENATE($B10,\"-\",AA$1),'База выдачи'!$A:$F,6,0)),\"\",VLOOKUP(CONCATENATE($B10,\"-\",AA$1),'База выдачи'!$A:$F,6,0)),VLOOKUP(CONCATENATE($B10,\"-\",AA$1),База!$A:$G,6,0))","v":""},"C",{"$f":"IF(ISERROR(VLOOKUP(CONCATENATE($B10,\"-\",AD$1),База!$A:$G,5,0)),IF(ISERROR(VLOOKUP(CONCATENATE($B10,\"-\",AD$1),'База выдачи'!$A:$F,5,0)),\"\",VLOOKUP(CONCATENATE($B10,\"-\",AD$1),'База выдачи'!$A:$F,5,0)),VLOOKUP(CONCATENATE($B10,\"-\",AD$1),База!$A:$G,5,0))","v":""},{"$f":"IF(ISERROR(VLOOKUP(CONCATENATE($B10,\"-\",AD$1),База!$A:$G,6,0)),IF(ISERROR(VLOOKUP(CONCATENATE($B10,\"-\",AD$1),'База выдачи'!$A:$F,6,0)),\"\",VLOOKUP(CONCATENATE($B10,\"-\",AD$1),'База выдачи'!$A:$F,6,0)),VLOOKUP(CONCATENATE($B10,\"-\",AD$1),База!$A:$G,6,0))","v":""},"D",{"$f":"IF(ISERROR(VLOOKUP(CONCATENATE($B10,\"-\",AG$1),База!$A:$G,5,0)),IF(ISERROR(VLOOKUP(CONCATENATE($B10,\"-\",AG$1),'База выдачи'!$A:$F,5,0)),\"\",VLOOKUP(CONCATENATE($B10,\"-\",AG$1),'База выдачи'!$A:$F,5,0)),VLOOKUP(CONCATENATE($B10,\"-\",AG$1),База!$A:$G,5,0))","v":""},{"$f":"IF(ISERROR(VLOOKUP(CONCATENATE($B10,\"-\",AG$1),База!$A:$G,6,0)),IF(ISERROR(VLOOKUP(CONCATENATE($B10,\"-\",AG$1),'База выдачи'!$A:$F,6,0)),\"\",VLOOKUP(CONCATENATE($B10,\"-\",AG$1),'База выдачи'!$A:$F,6,0)),VLOOKUP(CONCATENATE($B10,\"-\",AG$1),База!$A:$G,6,0))","v":""},"E",{"$f":"IF(ISERROR(VLOOKUP(CONCATENATE($B10,\"-\",AJ$1),База!$A:$G,5,0)),IF(ISERROR(VLOOKUP(CONCATENATE($B10,\"-\",AJ$1),'База выдачи'!$A:$F,5,0)),\"\",VLOOKUP(CONCATENATE($B10,\"-\",AJ$1),'База выдачи'!$A:$F,5,0)),VLOOKUP(CONCATENATE($B10,\"-\",AJ$1),База!$A:$G,5,0))","v":""},{"$f":"IF(ISERROR(VLOOKUP(CONCATENATE($B10,\"-\",AJ$1),База!$A:$G,6,0)),IF(ISERROR(VLOOKUP(CONCATENATE($B10,\"-\",AJ$1),'База выдачи'!$A:$F,6,0)),\"\",VLOOKUP(CONCATENATE($B10,\"-\",AJ$1),'База выдачи'!$A:$F,6,0)),VLOOKUP(CONCATENATE($B10,\"-\",AJ$1),База!$A:$G,6,0))","v":""},"F",{"$f":"IF(ISERROR(VLOOKUP(CONCATENATE($B10,\"-\",AM$1),База!$A:$G,5,0)),IF(ISERROR(VLOOKUP(CONCATENATE($B10,\"-\",AM$1),'База выдачи'!$A:$F,5,0)),\"\",VLOOKUP(CONCATENATE($B10,\"-\",AM$1),'База выдачи'!$A:$F,5,0)),VLOOKUP(CONCATENATE($B10,\"-\",AM$1),База!$A:$G,5,0))","v":""},{"$f":"IF(ISERROR(VLOOKUP(CONCATENATE($B10,\"-\",AM$1),База!$A:$G,6,0)),IF(ISERROR(VLOOKUP(CONCATENATE($B10,\"-\",AM$1),'База выдачи'!$A:$F,6,0)),\"\",VLOOKUP(CONCATENATE($B10,\"-\",AM$1),'База выдачи'!$A:$F,6,0)),VLOOKUP(CONCATENATE($B10,\"-\",AM$1),База!$A:$G,6,0))","v":""},"G",{"$f":"IF(ISERROR(VLOOKUP(CONCATENATE($B10,\"-\",AP$1),База!$A:$G,5,0)),IF(ISERROR(VLOOKUP(CONCATENATE($B10,\"-\",AP$1),'База выдачи'!$A:$F,5,0)),\"\",VLOOKUP(CONCATENATE($B10,\"-\",AP$1),'База выдачи'!$A:$F,5,0)),VLOOKUP(CONCATENATE($B10,\"-\",AP$1),База!$A:$G,5,0))","v":""},{"$f":"IF(ISERROR(VLOOKUP(CONCATENATE($B10,\"-\",AP$1),База!$A:$G,6,0)),IF(ISERROR(VLOOKUP(CONCATENATE($B10,\"-\",AP$1),'База выдачи'!$A:$F,6,0)),\"\",VLOOKUP(CONCATENATE($B10,\"-\",AP$1),'База выдачи'!$A:$F,6,0)),VLOOKUP(CONCATENATE($B10,\"-\",AP$1),База!$A:$G,6,0))","v":""},"H",{"$f":"IF(ISERROR(VLOOKUP(CONCATENATE($B10,\"-\",AS$1),База!$A:$G,5,0)),IF(ISERROR(VLOOKUP(CONCATENATE($B10,\"-\",AS$1),'База выдачи'!$A:$F,5,0)),\"\",VLOOKUP(CONCATENATE($B10,\"-\",AS$1),'База выдачи'!$A:$F,5,0)),VLOOKUP(CONCATENATE($B10,\"-\",AS$1),База!$A:$G,5,0))","v":""},{"$f":"IF(ISERROR(VLOOKUP(CONCATENATE($B10,\"-\",AS$1),База!$A:$G,6,0)),IF(ISERROR(VLOOKUP(CONCATENATE($B10,\"-\",AS$1),'База выдачи'!$A:$F,6,0)),\"\",VLOOKUP(CONCATENATE($B10,\"-\",AS$1),'База выдачи'!$A:$F,6,0)),VLOOKUP(CONCATENATE($B10,\"-\",AS$1),База!$A:$G,6,0))","v":""},null,null,{"$f":"COUNTIFS(База!B:B,Статистика!B10,База!E:E,\"OK\")","v":5},{"$f":"BU3","v":"02:38:28.780"},9509,{"$f":"COUNTIFS(База!B:B,Статистика!B10,База!E:E,\"XXXX\")","v":1},{"$f":"IF(AX10+AZ10+BA10=0,ксекундвигре-BD10,ксекундвигре*Статистика!AX10+(ксекундвигре-Статистика!AZ10)+Статистика!BA10)","v":55652},65495,8,25]
[9,{"$f":"IF(ISERROR(VLOOKUP(A11,Служебный!B:C,2,0)),\"\",A11&\"-\"&VLOOKUP(A11,Служебный!B:C,2,0))","v":"9-Джи 3"},9,{"$f":"IF(ISERROR(VLOOKUP(CONCATENATE($B11,\"-\",C$1),База!$A:$G,5,0)),IF(ISERROR(VLOOKUP(CONCATENATE($B11,\"-\",C$1),'База выдачи'!$A:$F,5,0)),\"\",VLOOKUP(CONCATENATE($B11,\"-\",C$1),'База выдачи'!$A:$F,5,0)),VLOOKUP(CONCATENATE($B11,\"-\",C$1),База!$A:$G,5,0))","v":"OK"},{"$f":"IF(ISERROR(VLOOKUP(CONCATENATE($B11,\"-\",C$1),База!$A:$G,6,0)),IF(ISERROR(VLOOKUP(CONCATENATE($B11,\"-\",C$1),'База выдачи'!$A:$F,6,0)),\"\",VLOOKUP(CONCATENATE($B11,\"-\",C$1),'База выдачи'!$A:$F,6,0)),VLOOKUP(CONCATENATE($B11,\"-\",C$1),База!$A:$G,6,0))","v":"00:28:16.780"},8,{"$f":"IF(ISERROR(VLOOKUP(CONCATENATE($B11,\"-\",F$1),База!$A:$G,5,0)),IF(ISERROR(VLOOKUP(CONCATENATE($B11,\"-\",F$1),'База выдачи'!$A:$F,5,0)),\"\",VLOOKUP(CONCATENATE($B11,\"-\",F$1),'База выдачи'!$A:$F,5,0)),VLOOKUP(CONCATENATE($B11,\"-\",F$1),База!$A:$G,5,0))","v":"OK"},{"$f":"IF(ISERROR(VLOOKUP(CONCATENATE($B11,\"-\",F$1),База!$A:$G,6,0)),IF(ISERROR(VLOOKUP(CONCATENATE($B11,\"-\",F$1),'База выдачи'!$A:$F,6,0)),\"\",VLOOKUP(CONCATENATE($B11,\"-\",F$1),'База выдачи'!$A:$F,6,0)),VLOOKUP(CONCATENATE($B11,\"-\",F$1),База!$A:$G,6,0))","v":"00:54:48.560"},7,{"$f":"IF(ISERROR(VLOOKUP(CONCATENATE($B11,\"-\",I$1),База!$A:$G,5,0)),IF(ISERROR(VLOOKUP(CONCATENATE($B11,\"-\",I$1),'База выдачи'!$A:$F,5,0)),\"\",VLOOKUP(CONCATENATE($B11,\"-\",I$1),'База выдачи'!$A:$F,5,0)),VLOOKUP(CONCATENATE($B11,\"-\",I$1),База!$A:$G,5,0))","v":"OK"},{"$f":"IF(ISERROR(VLOOKUP(CONCATENATE($B11,\"-\",I$1),База!$A:$G,6,0)),IF(ISERROR(VLOOKUP(CONCATENATE($B11,\"-\",I$1),'База выдачи'!$A:$F,6,0)),\"\",VLOOKUP(CONCATENATE($B11,\"-\",I$1),'База выдачи'!$A:$F,6,0)),VLOOKUP(CONCATENATE($B11,\"-\",I$1),База!$A:$G,6,0))","v":"01:22:04.920"},4,{"$f":"IF(ISERROR(VLOOKUP(CONCATENATE($B11,\"-\",L$1),База!$A:$G,5,0)),IF(ISERROR(VLOOKUP(CONCATENATE($B11,\"-\",L$1),'База выдачи'!$A:$F,5,0)),\"\",VLOOKUP(CONCATENATE($B11,\"-\",L$1),'База выдачи'!$A:$F,5,0)),VLOOKUP(CONCATENATE($B11,\"-\",L$1),База!$A:$G,5,0))","v":"OK"},{"$f":"IF(ISERROR(VLOOKUP(CONCATENATE($B11,\"-\",L$1),База!$A:$G,6,0)),IF(ISERROR(VLOOKUP(CONCATENATE($B11,\"-\",L$1),'База выдачи'!$A:$F,6,0)),\"\",VLOOKUP(CONCATENATE($B11,\"-\",L$1),'База выдачи'!$A:$F,6,0)),VLOOKUP(CONCATENATE($B11,\"-\",L$1),База!$A:$G,6,0))","v":"01:36:43.950"},2,{"$f":"IF(ISERROR(VLOOKUP(CONCATENATE($B11,\"-\",O$1),База!$A:$G,5,0)),IF(ISERROR(VLOOKUP(CONCATENATE($B11,\"-\",O$1),'База выдачи'!$A:$F,5,0)),\"\",VLOOKUP(CONCATENATE($B11,\"-\",O$1),'База выдачи'!$A:$F,5,0)),VLOOKUP(CONCATENATE($B11,\"-\",O$1),База!$A:$G,5,0))","v":"OK"},{"$f":"IF(ISERROR(VLOOKUP(CONCATENATE($B11,\"-\",O$1),База!$A:$G,6,0)),IF(ISERROR(VLOOKUP(CONCATENATE($B11,\"-\",O$1),'База выдачи'!$A:$F,6,0)),\"\",VLOOKUP(CONCATENATE($B11,\"-\",O$1),'База выдачи'!$A:$F,6,0)),VLOOKUP(CONCATENATE($B11,\"-\",O$1),База!$A:$G,6,0))","v":"01:49:04.560"},1,{"$f":"IF(ISERROR(VLOOKUP(CONCATENATE($B11,\"-\",R$1),База!$A:$G,5,0)),IF(ISERROR(VLOOKUP(CONCATENATE($B11,\"-\",R$1),'База выдачи'!$A:$F,5,0)),\"\",VLOOKUP(CONCATENATE($B11,\"-\",R$1),'База выдачи'!$A:$F,5,0)),VLOOKUP(CONCATENATE($B11,\"-\",R$1),База!$A:$G,5,0))","v":"OK"},{"$f":"IF(ISERROR(VLOOKUP(CONCATENATE($B11,\"-\",R$1),База!$A:$G,6,0)),IF(ISERROR(VLOOKUP(CONCATENATE($B11,\"-\",R$1),'База выдачи'!$A:$F,6,0)),\"\",VLOOKUP(CONCATENATE($B11,\"-\",R$1),'База выдачи'!$A:$F,6,0)),VLOOKUP(CONCATENATE($B11,\"-\",R$1),База!$A:$G,6,0))","v":"02:06:46.330"},3,{"$f":"IF(ISERROR(VLOOKUP(CONCATENATE($B11,\"-\",U$1),База!$A:$G,5,0)),IF(ISERROR(VLOOKUP(CONCATENATE($B11,\"-\",U$1),'База выдачи'!$A:$F,5,0)),\"\",VLOOKUP(CONCATENATE($B11,\"-\",U$1),'База выдачи'!$A:$F,5,0)),VLOOKUP(CONCATENATE($B11,\"-\",U$1),База!$A:$G,5,0))","v":"OK"},{"$f":"IF(ISERROR(VLOOKUP(CONCATENATE($B11,\"-\",U$1),База!$A:$G,6,0)),IF(ISERROR(VLOOKUP(CONCATENATE($B11,\"-\",U$1),'База выдачи'!$A:$F,6,0)),\"\",VLOOKUP(CONCATENATE($B11,\"-\",U$1),'База выдачи'!$A:$F,6,0)),VLOOKUP(CONCATENATE($B11,\"-\",U$1),База!$A:$G,6,0))","v":"02:23:59.360"},6,{"$f":"IF(ISERROR(VLOOKUP(CONCATENATE($B11,\"-\",X$1),База!$A:$G,5,0)),IF(ISERROR(VLOOKUP(CONCATENATE($B11,\"-\",X$1),'База выдачи'!$A:$F,5,0)),\"\",VLOOKUP(CONCATENATE($B11,\"-\",X$1),'База выдачи'!$A:$F,5,0)),VLOOKUP(CONCATENATE($B11,\"-\",X$1),База!$A:$G,5,0))","v":"ST"},{"$f":"IF(ISERROR(VLOOKUP(CONCATENATE($B11,\"-\",X$1),База!$A:$G,6,0)),IF(ISERROR(VLOOKUP(CONCATENATE($B11,\"-\",X$1),'База выдачи'!$A:$F,6,0)),\"\",VLOOKUP(CONCATENATE($B11,\"-\",X$1),'База выдачи'!$A:$F,6,0)),VLOOKUP(CONCATENATE($B11,\"-\",X$1),База!$A:$G,6,0))","v":"02:24:01.220"},5,{"$f":"IF(ISERROR(VLOOKUP(CONCATENATE($B11,\"-\",AA$1),База!$A:$G,5,0)),IF(ISERROR(VLOOKUP(CONCATENATE($B11,\"-\",AA$1),'База выдачи'!$A:$F,5,0)),\"\",VLOOKUP(CONCATENATE($B11,\"-\",AA$1),'База выдачи'!$A:$F,5,0)),VLOOKUP(CONCATENATE($B11,\"-\",AA$1),База!$A:$G,5,0))","v":""},{"$f":"IF(ISERROR(VLOOKUP(CONCATENATE($B11,\"-\",AA$1),База!$A:$G,6,0)),IF(ISERROR(VLOOKUP(CONCATENATE($B11,\"-\",AA$1),'База выдачи'!$A:$F,6,0)),\"\",VLOOKUP(CONCATENATE($B11,\"-\",AA$1),'База выдачи'!$A:$F,6,0)),VLOOKUP(CONCATENATE($B11,\"-\",AA$1),База!$A:$G,6,0))","v":""},"B",{"$f":"IF(ISERROR(VLOOKUP(CONCATENATE($B11,\"-\",AD$1),База!$A:$G,5,0)),IF(ISERROR(VLOOKUP(CONCATENATE($B11,\"-\",AD$1),'База выдачи'!$A:$F,5,0)),\"\",VLOOKUP(CONCATENATE($B11,\"-\",AD$1),'База выдачи'!$A:$F,5,0)),VLOOKUP(CONCATENATE($B11,\"-\",AD$1),База!$A:$G,5,0))","v":""},{"$f":"IF(ISERROR(VLOOKUP(CONCATENATE($B11,\"-\",AD$1),База!$A:$G,6,0)),IF(ISERROR(VLOOKUP(CONCATENATE($B11,\"-\",AD$1),'База выдачи'!$A:$F,6,0)),\"\",VLOOKUP(CONCATENATE($B11,\"-\",AD$1),'База выдачи'!$A:$F,6,0)),VLOOKUP(CONCATENATE($B11,\"-\",AD$1),База!$A:$G,6,0))","v":""},"C",{"$f":"IF(ISERROR(VLOOKUP(CONCATENATE($B11,\"-\",AG$1),База!$A:$G,5,0)),IF(ISERROR(VLOOKUP(CONCATENATE($B11,\"-\",AG$1),'База выдачи'!$A:$F,5,0)),\"\",VLOOKUP(CONCATENATE($B11,\"-\",AG$1),'База выдачи'!$A:$F,5,0)),VLOOKUP(CONCATENATE($B11,\"-\",AG$1),База!$A:$G,5,0))","v":""},{"$f":"IF(ISERROR(VLOOKUP(CONCATENATE($B11,\"-\",AG$1),База!$A:$G,6,0)),IF(ISERROR(VLOOKUP(CONCATENATE($B11,\"-\",AG$1),'База выдачи'!$A:$F,6,0)),\"\",VLOOKUP(CONCATENATE($B11,\"-\",AG$1),'База выдачи'!$A:$F,6,0)),VLOOKUP(CONCATENATE($B11,\"-\",AG$1),База!$A:$G,6,0))","v":""},"D",{"$f":"IF(ISERROR(VLOOKUP(CONCATENATE($B11,\"-\",AJ$1),База!$A:$G,5,0)),IF(ISERROR(VLOOKUP(CONCATENATE($B11,\"-\",AJ$1),'База выдачи'!$A:$F,5,0)),\"\",VLOOKUP(CONCATENATE($B11,\"-\",AJ$1),'База выдачи'!$A:$F,5,0)),VLOOKUP(CONCATENATE($B11,\"-\",AJ$1),База!$A:$G,5,0))","v":""},{"$f":"IF(ISERROR(VLOOKUP(CONCATENATE($B11,\"-\",AJ$1),База!$A:$G,6,0)),IF(ISERROR(VLOOKUP(CONCATENATE($B11,\"-\",AJ$1),'База выдачи'!$A:$F,6,0)),\"\",VLOOKUP(CONCATENATE($B11,\"-\",AJ$1),'База выдачи'!$A:$F,6,0)),VLOOKUP(CONCATENATE($B11,\"-\",AJ$1),База!$A:$G,6,0))","v":""},"E",{"$f":"IF(ISERROR(VLOOKUP(CONCATENATE($B11,\"-\",AM$1),База!$A:$G,5,0)),IF(ISERROR(VLOOKUP(CONCATENATE($B11,\"-\",AM$1),'База выдачи'!$A:$F,5,0)),\"\",VLOOKUP(CONCATENATE($B11,\"-\",AM$1),'База выдачи'!$A:$F,5,0)),VLOOKUP(CONCATENATE($B11,\"-\",AM$1),База!$A:$G,5,0))","v":""},{"$f":"IF(ISERROR(VLOOKUP(CONCATENATE($B11,\"-\",AM$1),База!$A:$G,6,0)),IF(ISERROR(VLOOKUP(CONCATENATE($B11,\"-\",AM$1),'База выдачи'!$A:$F,6,0)),\"\",VLOOKUP(CONCATENATE($B11,\"-\",AM$1),'База выдачи'!$A:$F,6,0)),VLOOKUP(CONCATENATE($B11,\"-\",AM$1),База!$A:$G,6,0))","v":""},"F",{"$f":"IF(ISERROR(VLOOKUP(CONCATENATE($B11,\"-\",AP$1),База!$A:$G,5,0)),IF(ISERROR(VLOOKUP(CONCATENATE($B11,\"-\",AP$1),'База выдачи'!$A:$F,5,0)),\"\",VLOOKUP(CONCATENATE($B11,\"-\",AP$1),'База выдачи'!$A:$F,5,0)),VLOOKUP(CONCATENATE($B11,\"-\",AP$1),База!$A:$G,5,0))","v":""},{"$f":"IF(ISERROR(VLOOKUP(CONCATENATE($B11,\"-\",AP$1),База!$A:$G,6,0)),IF(ISERROR(VLOOKUP(CONCATENATE($B11,\"-\",AP$1),'База выдачи'!$A:$F,6,0)),\"\",VLOOKUP(CONCATENATE($B11,\"-\",AP$1),'База выдачи'!$A:$F,6,0)),VLOOKUP(CONCATENATE($B11,\"-\",AP$1),База!$A:$G,6,0))","v":""},"G",{"$f":"IF(ISERROR(VLOOKUP(CONCATENATE($B11,\"-\",AS$1),База!$A:$G,5,0)),IF(ISERROR(VLOOKUP(CONCATENATE($B11,\"-\",AS$1),'База выдачи'!$A:$F,5,0)),\"\",VLOOKUP(CONCATENATE($B11,\"-\",AS$1),'База выдачи'!$A:$F,5,0)),VLOOKUP(CONCATENATE($B11,\"-\",AS$1),База!$A:$G,5,0))","v":""},{"$f":"IF(ISERROR(VLOOKUP(CONCATENATE($B11,\"-\",AS$1),База!$A:$G,6,0)),IF(ISERROR(VLOOKUP(CONCATENATE($B11,\"-\",AS$1),'База выдачи'!$A:$F,6,0)),\"\",VLOOKUP(CONCATENATE($B11,\"-\",AS$1),'База выдачи'!$A:$F,6,0)),VLOOKUP(CONCATENATE($B11,\"-\",AS$1),База!$A:$G,6,0))","v":""},null,null,{"$f":"COUNTIFS(База!B:B,Статистика!B11,База!E:E,\"OK\")","v":7},{"$f":"BW3","v":"02:23:59.360"},8639,{"$f":"COUNTIFS(База!B:B,Статистика!B11,База!E:E,\"XXXX\")","v":0},{"$f":"IF(AX11+AZ11+BA11=0,ксекундвигре-BD11,ксекундвигре*Статистика!AX11+(ксекундвигре-Статистика!AZ11)+Статистика!BA11)","v":78241},65437,9,5]
[10,{"$f":"IF(ISERROR(VLOOKUP(A12,Служебный!B:C,2,0)),\"\",A12&\"-\"&VLOOKUP(A12,Служебный!B:C,2,0))","v":"10-Т-34"},1,{"$f":"IF(ISERROR(VLOOKUP(CONCATENATE($B12,\"-\",C$1),База!$A:$G,5,0)),IF(ISERROR(VLOOKUP(CONCATENATE($B12,\"-\",C$1),'База выдачи'!$A:$F,5,0)),\"\",VLOOKUP(CONCATENATE($B12,\"-\",C$1),'База выдачи'!$A:$F,5,0)),VLOOKUP(CONCATENATE($B12,\"-\",C$1),База!$A:$G,5,0))","v":"XXXX"},{"$f":"IF(ISERROR(VLOOKUP(CONCATENATE($B12,\"-\",C$1),База!$A:$G,6,0)),IF(ISERROR(VLOOKUP(CONCATENATE($B12,\"-\",C$1),'База выдачи'!$A:$F,6,0)),\"\",VLOOKUP(CONCATENATE($B12,\"-\",C$1),'База выдачи'!$A:$F,6,0)),VLOOKUP(CONCATENATE($B12,\"-\",C$1),База!$A:$G,6,0))","v":"00:54:33.010"},5,{"$f":"IF(ISERROR(VLOOKUP(CONCATENATE($B12,\"-\",F$1),База!$A:$G,5,0)),IF(ISERROR(VLOOKUP(CONCATENATE($B12,\"-\",F$1),'База выдачи'!$A:$F,5,0)),\"\",VLOOKUP(CONCATENATE($B12,\"-\",F$1),'База выдачи'!$A:$F,5,0)),VLOOKUP(CONCATENATE($B12,\"-\",F$1),База!$A:$G,5,0))","v":"OK"},{"$f":"IF(ISERROR(VLOOKUP(CONCATENATE($B12,\"-\",F$1),База!$A:$G,6,0)),IF(ISERROR(VLOOKUP(CONCATENATE($B12,\"-\",F$1),'База выдачи'!$A:$F,6,0)),\"\",VLOOKUP(CONCATENATE($B12,\"-\",F$1),'База выдачи'!$A:$F,6,0)),VLOOKUP(CONCATENATE($B12,\"-\",F$1),База!$A:$G,6,0))","v":"01:10:58.550"},3,{"$f":"IF(ISERROR(VLOOKUP(CONCATENATE($B12,\"-\",I$1),База!$A:$G,5,0)),IF(ISERROR(VLOOKUP(CONCATENATE($B12,\"-\",I$1),'База выдачи'!$A:$F,5,0)),\"\",VLOOKUP(CONCATENATE($B12,\"-\",I$1),'База выдачи'!$A:$F,5,0)),VLOOKUP(CONCATENATE($B12,\"-\",I$1),База!$A:$G,5,0))","v":"OK"},{"$f":"IF(ISERROR(VLOOKUP(CONCATENATE($B12,\"-\",I$1),База!$A:$G,6,0)),IF(ISERROR(VLOOKUP(CONCATENATE($B12,\"-\",I$1),'База выдачи'!$A:$F,6,0)),\"\",VLOOKUP(CONCATENATE($B12,\"-\",I$1),'База выдачи'!$A:$F,6,0)),VLOOKUP(CONCATENATE($B12,\"-\",I$1),База!$A:$G,6,0))","v":"01:39:43.740"},7,{"$f":"IF(ISERROR(VLOOKUP(CONCATENATE($B12,\"-\",L$1),База!$A:$G,5,0)),IF(ISERROR(VLOOKUP(CONCATENATE($B12,\"-\",L$1),'База выдачи'!$A:$F,5,0)),\"\",VLOOKUP(CONCATENATE($B12,\"-\",L$1),'База выдачи'!$A:$F,5,0)),VLOOKUP(CONCATENATE($B12,\"-\",L$1),База!$A:$G,5,0))","v":"OK"},{"$f":"IF(ISERROR(VLOOKUP(CONCATENATE($B12,\"-\",L$1),База!$A:$G,6,0)),IF(ISERROR(VLOOKUP(CONCATENATE($B12,\"-\",L$1),'База выдачи'!$A:$F,6,0)),\"\",VLOOKUP(CONCATENATE($B12,\"-\",L$1),'База выдачи'!$A:$F,6,0)),VLOOKUP(CONCATENATE($B12,\"-\",L$1),База!$A:$G,6,0))","v":"02:09:27.150"},2,{"$f":"IF(ISERROR(VLOOKUP(CONCATENATE($B12,\"-\",O$1),База!$A:$G,5,0)),IF(ISERROR(VLOOKUP(CONCATENATE($B12,\"-\",O$1),'База выдачи'!$A:$F,5,0)),\"\",VLOOKUP(CONCATENATE($B12,\"-\",O$1),'База выдачи'!$A:$F,5,0)),VLOOKUP(CONCATENATE($B12,\"-\",O$1),База!$A:$G,5,0))","v":"ST"},{"$f":"IF(ISERROR(VLOOKUP(CONCATENATE($B12,\"-\",O$1),База!$A:$G,6,0)),IF(ISERROR(VLOOKUP(CONCATENATE($B12,\"-\",O$1),'База выдачи'!$A:$F,6,0)),\"\",VLOOKUP(CONCATENATE($B12,\"-\",O$1),'База выдачи'!$A:$F,6,0)),VLOOKUP(CONCATENATE($B12,\"-\",O$1),База!$A:$G,6,0))","v":"02:09:28.980"},9,{"$f":"IF(ISERROR(VLOOKUP(CONCATENATE($B12,\"-\",R$1),База!$A:$G,5,0)),IF(ISERROR(VLOOKUP(CONCATENATE($B12,\"-\",R$1),'База выдачи'!$A:$F,5,0)),\"\",VLOOKUP(CONCATENATE($B12,\"-\",R$1),'База выдачи'!$A:$F,5,0)),VLOOKUP(CONCATENATE($B12,\"-\",R$1),База!$A:$G,5,0))","v":""},{"$f":"IF(ISERROR(VLOOKUP(CONCATENATE($B12,\"-\",R$1),База!$A:$G,6,0)),IF(ISERROR(VLOOKUP(CONCATENATE($B12,\"-\",R$1),'База выдачи'!$A:$F,6,0)),\"\",VLOOKUP(CONCATENATE($B12,\"-\",R$1),'База выдачи'!$A:$F,6,0)),VLOOKUP(CONCATENATE($B12,\"-\",R$1),База!$A:$G,6,0))","v":""},4,{"$f":"IF(ISERROR(VLOOKUP(CONCATENATE($B12,\"-\",U$1),База!$A:$G,5,0)),IF(ISERROR(VLOOKUP(CONCATENATE($B12,\"-\",U$1),'База выдачи'!$A:$F,5,0)),\"\",VLOOKUP(CONCATENATE($B12,\"-\",U$1),'База выдачи'!$A:$F,5,0)),VLOOKUP(CONCATENATE($B12,\"-\",U$1),База!$A:$G,5,0))","v":""},{"$f":"IF(ISERROR(VLOOKUP(CONCATENATE($B12,\"-\",U$1),База!$A:$G,6,0)),IF(ISERROR(VLOOKUP(CONCATENATE($B12,\"-\",U$1),'База выдачи'!$A:$F,6,0)),\"\",VLOOKUP(CONCATENATE($B12,\"-\",U$1),'База выдачи'!$A:$F,6,0)),VLOOKUP(CONCATENATE($B12,\"-\",U$1),База!$A:$G,6,0))","v":""},8,{"$f":"IF(ISERROR(VLOOKUP(CONCATENATE($B12,\"-\",X$1),База!$A:$G,5,0)),IF(ISERROR(VLOOKUP(CONCATENATE($B12,\"-\",X$1),'База выдачи'!$A:$F,5,0)),\"\",VLOOKUP(CONCATENATE($B12,\"-\",X$1),'База выдачи'!$A:$F,5,0)),VLOOKUP(CONCATENATE($B12,\"-\",X$1),База!$A:$G,5,0))","v":""},{"$f":"IF(ISERROR(VLOOKUP(CONCATENATE($B12,\"-\",X$1),База!$A:$G,6,0)),IF(ISERROR(VLOOKUP(CONCATENATE($B12,\"-\",X$1),'База выдачи'!$A:$F,6,0)),\"\",VLOOKUP(CONCATENATE($B12,\"-\",X$1),'База выдачи'!$A:$F,6,0)),VLOOKUP(CONCATENATE($B12,\"-\",X$1),База!$A:$G,6,0))","v":""},6,{"$f":"IF(ISERROR(VLOOKUP(CONCATENATE($B12,\"-\",AA$1),База!$A:$G,5,0)),IF(ISERROR(VLOOKUP(CONCATENATE($B12,\"-\",AA$1),'База выдачи'!$A:$F,5,0)),\"\",VLOOKUP(CONCATENATE($B12,\"-\",AA$1),'База выдачи'!$A:$F,5,0)),VLOOKUP(CONCATENATE($B12,\"-\",AA$1),База!$A:$G,5,0))","v":""},{"$f":"IF(ISERROR(VLOOKUP(CONCATENATE($B12,\"-\",AA$1),База!$A:$G,6,0)),IF(ISERROR(VLOOKUP(CONCATENATE($B12,\"-\",AA$1),'База выдачи'!$A:$F,6,0)),\"\",VLOOKUP(CONCATENATE($B12,\"-\",AA$1),'База выдачи'!$A:$F,6,0)),VLOOKUP(CONCATENATE($B12,\"-\",AA$1),База!$A:$G,6,0))","v":""},"A",{"$f":"IF(ISERROR(VLOOKUP(CONCATENATE($B12,\"-\",AD$1),База!$A:$G,5,0)),IF(ISERROR(VLOOKUP(CONCATENATE($B12,\"-\",AD$1),'База выдачи'!$A:$F,5,0)),\"\",VLOOKUP(CONCATENATE($B12,\"-\",AD$1),'База выдачи'!$A:$F,5,0)),VLOOKUP(CONCATENATE($B12,\"-\",AD$1),База!$A:$G,5,0))","v":""},{"$f":"IF(ISERROR(VLOOKUP(CONCATENATE($B12,\"-\",AD$1),База!$A:$G,6,0)),IF(ISERROR(VLOOKUP(CONCATENATE($B12,\"-\",AD$1),'База выдачи'!$A:$F,6,0)),\"\",VLOOKUP(CONCATENATE($B12,\"-\",AD$1),'База выдачи'!$A:$F,6,0)),VLOOKUP(CONCATENATE($B12,\"-\",AD$1),База!$A:$G,6,0))","v":""},"B",{"$f":"IF(ISERROR(VLOOKUP(CONCATENATE($B12,\"-\",AG$1),База!$A:$G,5,0)),IF(ISERROR(VLOOKUP(CONCATENATE($B12,\"-\",AG$1),'База выдачи'!$A:$F,5,0)),\"\",VLOOKUP(CONCATENATE($B12,\"-\",AG$1),'База выдачи'!$A:$F,5,0)),VLOOKUP(CONCATENATE($B12,\"-\",AG$1),База!$A:$G,5,0))","v":""},{"$f":"IF(ISERROR(VLOOKUP(CONCATENATE($B12,\"-\",AG$1),База!$A:$G,6,0)),IF(ISERROR(VLOOKUP(CONCATENATE($B12,\"-\",AG$1),'База выдачи'!$A:$F,6,0)),\"\",VLOOKUP(CONCATENATE($B12,\"-\",AG$1),'База выдачи'!$A:$F,6,0)),VLOOKUP(CONCATENATE($B12,\"-\",AG$1),База!$A:$G,6,0))","v":""},"C",{"$f":"IF(ISERROR(VLOOKUP(CONCATENATE($B12,\"-\",AJ$1),База!$A:$G,5,0)),IF(ISERROR(VLOOKUP(CONCATENATE($B12,\"-\",AJ$1),'База выдачи'!$A:$F,5,0)),\"\",VLOOKUP(CONCATENATE($B12,\"-\",AJ$1),'База выдачи'!$A:$F,5,0)),VLOOKUP(CONCATENATE($B12,\"-\",AJ$1),База!$A:$G,5,0))","v":""},{"$f":"IF(ISERROR(VLOOKUP(CONCATENATE($B12,\"-\",AJ$1),База!$A:$G,6,0)),IF(ISERROR(VLOOKUP(CONCATENATE($B12,\"-\",AJ$1),'База выдачи'!$A:$F,6,0)),\"\",VLOOKUP(CONCATENATE($B12,\"-\",AJ$1),'База выдачи'!$A:$F,6,0)),VLOOKUP(CONCATENATE($B12,\"-\",AJ$1),База!$A:$G,6,0))","v":""},"D",{"$f":"IF(ISERROR(VLOOKUP(CONCATENATE($B12,\"-\",AM$1),База!$A:$G,5,0)),IF(ISERROR(VLOOKUP(CONCATENATE($B12,\"-\",AM$1),'База выдачи'!$A:$F,5,0)),\"\",VLOOKUP(CONCATENATE($B12,\"-\",AM$1),'База выдачи'!$A:$F,5,0)),VLOOKUP(CONCATENATE($B12,\"-\",AM$1),База!$A:$G,5,0))","v":""},{"$f":"IF(ISERROR(VLOOKUP(CONCATENATE($B12,\"-\",AM$1),База!$A:$G,6,0)),IF(ISERROR(VLOOKUP(CONCATENATE($B12,\"-\",AM$1),'База выдачи'!$A:$F,6,0)),\"\",VLOOKUP(CONCATENATE($B12,\"-\",AM$1),'База выдачи'!$A:$F,6,0)),VLOOKUP(CONCATENATE($B12,\"-\",AM$1),База!$A:$G,6,0))","v":""},"E",{"$f":"IF(ISERROR(VLOOKUP(CONCATENATE($B12,\"-\",AP$1),База!$A:$G,5,0)),IF(ISERROR(VLOOKUP(CONCATENATE($B12,\"-\",AP$1),'База выдачи'!$A:$F,5,0)),\"\",VLOOKUP(CONCATENATE($B12,\"-\",AP$1),'База выдачи'!$A:$F,5,0)),VLOOKUP(CONCATENATE($B12,\"-\",AP$1),База!$A:$G,5,0))","v":""},{"$f":"IF(ISERROR(VLOOKUP(CONCATENATE($B12,\"-\",AP$1),База!$A:$G,6,0)),IF(ISERROR(VLOOKUP(CONCATENATE($B12,\"-\",AP$1),'База выдачи'!$A:$F,6,0)),\"\",VLOOKUP(CONCATENATE($B12,\"-\",AP$1),'База выдачи'!$A:$F,6,0)),VLOOKUP(CONCATENATE($B12,\"-\",AP$1),База!$A:$G,6,0))","v":""},"F",{"$f":"IF(ISERROR(VLOOKUP(CONCATENATE($B12,\"-\",AS$1),База!$A:$G,5,0)),IF(ISERROR(VLOOKUP(CONCATENATE($B12,\"-\",AS$1),'База выдачи'!$A:$F,5,0)),\"\",VLOOKUP(CONCATENATE($B12,\"-\",AS$1),'База выдачи'!$A:$F,5,0)),VLOOKUP(CONCATENATE($B12,\"-\",AS$1),База!$A:$G,5,0))","v":""},{"$f":"IF(ISERROR(VLOOKUP(CONCATENATE($B12,\"-\",AS$1),База!$A:$G,6,0)),IF(ISERROR(VLOOKUP(CONCATENATE($B12,\"-\",AS$1),'База выдачи'!$A:$F,6,0)),\"\",VLOOKUP(CONCATENATE($B12,\"-\",AS$1),'База выдачи'!$A:$F,6,0)),VLOOKUP(CONCATENATE($B12,\"-\",AS$1),База!$A:$G,6,0))","v":""},null,null,{"$f":"COUNTIFS(База!B:B,Статистика!B12,База!E:E,\"OK\")","v":3},{"$f":"BY3","v":"02:09:27.150"},7767,{"$f":"COUNTIFS(База!B:B,Статистика!B12,База!E:E,\"XXXX\")","v":1},{"$f":"IF(AX12+AZ12+BA12=0,ксекундвигре-BD12,ксекундвигре*Статистика!AX12+(ксекундвигре-Статистика!AZ12)+Статистика!BA12)","v":35674},65344,10,15]
[11,{"$f":"IF(ISERROR(VLOOKUP(A13,Служебный!B:C,2,0)),\"\",A13&\"-\"&VLOOKUP(A13,Служебный!B:C,2,0))","v":"11-Артур Пирожков"},2,{"$f":"IF(ISERROR(VLOOKUP(CONCATENATE($B13,\"-\",C$1),База!$A:$G,5,0)),IF(ISERROR(VLOOKUP(CONCATENATE($B13,\"-\",C$1),'База выдачи'!$A:$F,5,0)),\"\",VLOOKUP(CONCATENATE($B13,\"-\",C$1),'База выдачи'!$A:$F,5,0)),VLOOKUP(CONCATENATE($B13,\"-\",C$1),База!$A:$G,5,0))","v":"OK"},{"$f":"IF(ISERROR(VLOOKUP(CONCATENATE($B13,\"-\",C$1),База!$A:$G,6,0)),IF(ISERROR(VLOOKUP(CONCATENATE($B13,\"-\",C$1),'База выдачи'!$A:$F,6,0)),\"\",VLOOKUP(CONCATENATE($B13,\"-\",C$1),'База выдачи'!$A:$F,6,0)),VLOOKUP(CONCATENATE($B13,\"-\",C$1),База!$A:$G,6,0))","v":"00:45:38.930"},4,{"$f":"IF(ISERROR(VLOOKUP(CONCATENATE($B13,\"-\",F$1),База!$A:$G,5,0)),IF(ISERROR(VLOOKUP(CONCATENATE($B13,\"-\",F$1),'База выдачи'!$A:$F,5,0)),\"\",VLOOKUP(CONCATENATE($B13,\"-\",F$1),'База выдачи'!$A:$F,5,0)),VLOOKUP(CONCATENATE($B13,\"-\",F$1),База!$A:$G,5,0))","v":"OK"},{"$f":"IF(ISERROR(VLOOKUP(CONCATENATE($B13,\"-\",F$1),База!$A:$G,6,0)),IF(ISERROR(VLOOKUP(CONCATENATE($B13,\"-\",F$1),'База выдачи'!$A:$F,6,0)),\"\",VLOOKUP(CONCATENATE($B13,\"-\",F$1),'База выдачи'!$A:$F,6,0)),VLOOKUP(CONCATENATE($B13,\"-\",F$1),База!$A:$G,6,0))","v":"01:17:46.340"},6,{"$f":"IF(ISERROR(VLOOKUP(CONCATENATE($B13,\"-\",I$1),База!$A:$G,5,0)),IF(ISERROR(VLOOKUP(CONCATENATE($B13,\"-\",I$1),'База выдачи'!$A:$F,5,0)),\"\",VLOOKUP(CONCATENATE($B13,\"-\",I$1),'База выдачи'!$A:$F,5,0)),VLOOKUP(CONCATENATE($B13,\"-\",I$1),База!$A:$G,5,0))","v":"OK"},{"$f":"IF(ISERROR(VLOOKUP(CONCATENATE($B13,\"-\",I$1),База!$A:$G,6,0)),IF(ISERROR(VLOOKUP(CONCATENATE($B13,\"-\",I$1),'База выдачи'!$A:$F,6,0)),\"\",VLOOKUP(CONCATENATE($B13,\"-\",I$1),'База выдачи'!$A:$F,6,0)),VLOOKUP(CONCATENATE($B13,\"-\",I$1),База!$A:$G,6,0))","v":"02:45:24.270"},8,{"$f":"IF(ISERROR(VLOOKUP(CONCATENATE($B13,\"-\",L$1),База!$A:$G,5,0)),IF(ISERROR(VLOOKUP(CONCATENATE($B13,\"-\",L$1),'База выдачи'!$A:$F,5,0)),\"\",VLOOKUP(CONCATENATE($B13,\"-\",L$1),'База выдачи'!$A:$F,5,0)),VLOOKUP(CONCATENATE($B13,\"-\",L$1),База!$A:$G,5,0))","v":"OK"},{"$f":"IF(ISERROR(VLOOKUP(CONCATENATE($B13,\"-\",L$1),База!$A:$G,6,0)),IF(ISERROR(VLOOKUP(CONCATENATE($B13,\"-\",L$1),'База выдачи'!$A:$F,6,0)),\"\",VLOOKUP(CONCATENATE($B13,\"-\",L$1),'База выдачи'!$A:$F,6,0)),VLOOKUP(CONCATENATE($B13,\"-\",L$1),База!$A:$G,6,0))","v":"02:59:22.990"},1,{"$f":"IF(ISERROR(VLOOKUP(CONCATENATE($B13,\"-\",O$1),База!$A:$G,5,0)),IF(ISERROR(VLOOKUP(CONCATENATE($B13,\"-\",O$1),'База выдачи'!$A:$F,5,0)),\"\",VLOOKUP(CONCATENATE($B13,\"-\",O$1),'База выдачи'!$A:$F,5,0)),VLOOKUP(CONCATENATE($B13,\"-\",O$1),База!$A:$G,5,0))","v":"ST"},{"$f":"IF(ISERROR(VLOOKUP(CONCATENATE($B13,\"-\",O$1),База!$A:$G,6,0)),IF(ISERROR(VLOOKUP(CONCATENATE($B13,\"-\",O$1),'База выдачи'!$A:$F,6,0)),\"\",VLOOKUP(CONCATENATE($B13,\"-\",O$1),'База выдачи'!$A:$F,6,0)),VLOOKUP(CONCATENATE($B13,\"-\",O$1),База!$A:$G,6,0))","v":"02:59:24.960"},3,{"$f":"IF(ISERROR(VLOOKUP(CONCATENATE($B13,\"-\",R$1),База!$A:$G,5,0)),IF(ISERROR(VLOOKUP(CONCATENATE($B13,\"-\",R$1),'База выдачи'!$A:$F,5,0)),\"\",VLOOKUP(CONCATENATE($B13,\"-\",R$1),'База выдачи'!$A:$F,5,0)),VLOOKUP(CONCATENATE($B13,\"-\",R$1),База!$A:$G,5,0))","v":""},{"$f":"IF(ISERROR(VLOOKUP(CONCATENATE($B13,\"-\",R$1),База!$A:$G,6,0)),IF(ISERROR(VLOOKUP(CONCATENATE($B13,\"-\",R$1),'База выдачи'!$A:$F,6,0)),\"\",VLOOKUP(CONCATENATE($B13,\"-\",R$1),'База выдачи'!$A:$F,6,0)),VLOOKUP(CONCATENATE($B13,\"-\",R$1),База!$A:$G,6,0))","v":""},5,{"$f":"IF(ISERROR(VLOOKUP(CONCATENATE($B13,\"-\",U$1),База!$A:$G,5,0)),IF(ISERROR(VLOOKUP(CONCATENATE($B13,\"-\",U$1),'База выдачи'!$A:$F,5,0)),\"\",VLOOKUP(CONCATENATE($B13,\"-\",U$1),'База выдачи'!$A:$F,5,0)),VLOOKUP(CONCATENATE($B13,\"-\",U$1),База!$A:$G,5,0))","v":""},{"$f":"IF(ISERROR(VLOOKUP(CONCATENATE($B13,\"-\",U$1),База!$A:$G,6,0)),IF(ISERROR(VLOOKUP(CONCATENATE($B13,\"-\",U$1),'База выдачи'!$A:$F,6,0)),\"\",VLOOKUP(CONCATENATE($B13,\"-\",U$1),'База выдачи'!$A:$F,6,0)),VLOOKUP(CONCATENATE($B13,\"-\",U$1),База!$A:$G,6,0))","v":""},7,{"$f":"IF(ISERROR(VLOOKUP(CONCATENATE($B13,\"-\",X$1),База!$A:$G,5,0)),IF(ISERROR(VLOOKUP(CONCATENATE($B13,\"-\",X$1),'База выдачи'!$A:$F,5,0)),\"\",VLOOKUP(CONCATENATE($B13,\"-\",X$1),'База выдачи'!$A:$F,5,0)),VLOOKUP(CONCATENATE($B13,\"-\",X$1),База!$A:$G,5,0))","v":""},{"$f":"IF(ISERROR(VLOOKUP(CONCATENATE($B13,\"-\",X$1),База!$A:$G,6,0)),IF(ISERROR(VLOOKUP(CONCATENATE($B13,\"-\",X$1),'База выдачи'!$A:$F,6,0)),\"\",VLOOKUP(CONCATENATE($B13,\"-\",X$1),'База выдачи'!$A:$F,6,0)),VLOOKUP(CONCATENATE($B13,\"-\",X$1),База!$A:$G,6,0))","v":""},9,{"$f":"IF(ISERROR(VLOOKUP(CONCATENATE($B13,\"-\",AA$1),База!$A:$G,5,0)),IF(ISERROR(VLOOKUP(CONCATENATE($B13,\"-\",AA$1),'База выдачи'!$A:$F,5,0)),\"\",VLOOKUP(CONCATENATE($B13,\"-\",AA$1),'База выдачи'!$A:$F,5,0)),VLOOKUP(CONCATENATE($B13,\"-\",AA$1),База!$A:$G,5,0))","v":""},{"$f":"IF(ISERROR(VLOOKUP(CONCATENATE($B13,\"-\",AA$1),База!$A:$G,6,0)),IF(ISERROR(VLOOKUP(CONCATENATE($B13,\"-\",AA$1),'База выдачи'!$A:$F,6,0)),\"\",VLOOKUP(CONCATENATE($B13,\"-\",AA$1),'База выдачи'!$A:$F,6,0)),VLOOKUP(CONCATENATE($B13,\"-\",AA$1),База!$A:$G,6,0))","v":""},"O",{"$f":"IF(ISERROR(VLOOKUP(CONCATENATE($B13,\"-\",AD$1),База!$A:$G,5,0)),IF(ISERROR(VLOOKUP(CONCATENATE($B13,\"-\",AD$1),'База выдачи'!$A:$F,5,0)),\"\",VLOOKUP(CONCATENATE($B13,\"-\",AD$1),'База выдачи'!$A:$F,5,0)),VLOOKUP(CONCATENATE($B13,\"-\",AD$1),База!$A:$G,5,0))","v":""},{"$f":"IF(ISERROR(VLOOKUP(CONCATENATE($B13,\"-\",AD$1),База!$A:$G,6,0)),IF(ISERROR(VLOOKUP(CONCATENATE($B13,\"-\",AD$1),'База выдачи'!$A:$F,6,0)),\"\",VLOOKUP(CONCATENATE($B13,\"-\",AD$1),'База выдачи'!$A:$F,6,0)),VLOOKUP(CONCATENATE($B13,\"-\",AD$1),База!$A:$G,6,0))","v":""},"A",{"$f":"IF(ISERROR(VLOOKUP(CONCATENATE($B13,\"-\",AG$1),База!$A:$G,5,0)),IF(ISERROR(VLOOKUP(CONCATENATE($B13,\"-\",AG$1),'База выдачи'!$A:$F,5,0)),\"\",VLOOKUP(CONCATENATE($B13,\"-\",AG$1),'База выдачи'!$A:$F,5,0)),VLOOKUP(CONCATENATE($B13,\"-\",AG$1),База!$A:$G,5,0))","v":""},{"$f":"IF(ISERROR(VLOOKUP(CONCATENATE($B13,\"-\",AG$1),База!$A:$G,6,0)),IF(ISERROR(VLOOKUP(CONCATENATE($B13,\"-\",AG$1),'База выдачи'!$A:$F,6,0)),\"\",VLOOKUP(CONCATENATE($B13,\"-\",AG$1),'База выдачи'!$A:$F,6,0)),VLOOKUP(CONCATENATE($B13,\"-\",AG$1),База!$A:$G,6,0))","v":""},"B",{"$f":"IF(ISERROR(VLOOKUP(CONCATENATE($B13,\"-\",AJ$1),База!$A:$G,5,0)),IF(ISERROR(VLOOKUP(CONCATENATE($B13,\"-\",AJ$1),'База выдачи'!$A:$F,5,0)),\"\",VLOOKUP(CONCATENATE($B13,\"-\",AJ$1),'База выдачи'!$A:$F,5,0)),VLOOKUP(CONCATENATE($B13,\"-\",AJ$1),База!$A:$G,5,0))","v":""},{"$f":"IF(ISERROR(VLOOKUP(CONCATENATE($B13,\"-\",AJ$1),База!$A:$G,6,0)),IF(ISERROR(VLOOKUP(CONCATENATE($B13,\"-\",AJ$1),'База выдачи'!$A:$F,6,0)),\"\",VLOOKUP(CONCATENATE($B13,\"-\",AJ$1),'База выдачи'!$A:$F,6,0)),VLOOKUP(CONCATENATE($B13,\"-\",AJ$1),База!$A:$G,6,0))","v":""},"C",{"$f":"IF(ISERROR(VLOOKUP(CONCATENATE($B13,\"-\",AM$1),База!$A:$G,5,0)),IF(ISERROR(VLOOKUP(CONCATENATE($B13,\"-\",AM$1),'База выдачи'!$A:$F,5,0)),\"\",VLOOKUP(CONCATENATE($B13,\"-\",AM$1),'База выдачи'!$A:$F,5,0)),VLOOKUP(CONCATENATE($B13,\"-\",AM$1),База!$A:$G,5,0))","v":""},{"$f":"IF(ISERROR(VLOOKUP(CONCATENATE($B13,\"-\",AM$1),База!$A:$G,6,0)),IF(ISERROR(VLOOKUP(CONCATENATE($B13,\"-\",AM$1),'База выдачи'!$A:$F,6,0)),\"\",VLOOKUP(CONCATENATE($B13,\"-\",AM$1),'База выдачи'!$A:$F,6,0)),VLOOKUP(CONCATENATE($B13,\"-\",AM$1),База!$A:$G,6,0))","v":""},"D",{"$f":"IF(ISERROR(VLOOKUP(CONCATENATE($B13,\"-\",AP$1),База!$A:$G,5,0)),IF(ISERROR(VLOOKUP(CONCATENATE($B13,\"-\",AP$1),'База выдачи'!$A:$F,5,0)),\"\",VLOOKUP(CONCATENATE($B13,\"-\",AP$1),'База выдачи'!$A:$F,5,0)),VLOOKUP(CONCATENATE($B13,\"-\",AP$1),База!$A:$G,5,0))","v":""},{"$f":"IF(ISERROR(VLOOKUP(CONCATENATE($B13,\"-\",AP$1),База!$A:$G,6,0)),IF(ISERROR(VLOOKUP(CONCATENATE($B13,\"-\",AP$1),'База выдачи'!$A:$F,6,0)),\"\",VLOOKUP(CONCATENATE($B13,\"-\",AP$1),'База выдачи'!$A:$F,6,0)),VLOOKUP(CONCATENATE($B13,\"-\",AP$1),База!$A:$G,6,0))","v":""},"E",{"$f":"IF(ISERROR(VLOOKUP(CONCATENATE($B13,\"-\",AS$1),База!$A:$G,5,0)),IF(ISERROR(VLOOKUP(CONCATENATE($B13,\"-\",AS$1),'База выдачи'!$A:$F,5,0)),\"\",VLOOKUP(CONCATENATE($B13,\"-\",AS$1),'База выдачи'!$A:$F,5,0)),VLOOKUP(CONCATENATE($B13,\"-\",AS$1),База!$A:$G,5,0))","v":""},{"$f":"IF(ISERROR(VLOOKUP(CONCATENATE($B13,\"-\",AS$1),База!$A:$G,6,0)),IF(ISERROR(VLOOKUP(CONCATENATE($B13,\"-\",AS$1),'База выдачи'!$A:$F,6,0)),\"\",VLOOKUP(CONCATENATE($B13,\"-\",AS$1),'База выдачи'!$A:$F,6,0)),VLOOKUP(CONCATENATE($B13,\"-\",AS$1),База!$A:$G,6,0))","v":""},null,null,{"$f":"COUNTIFS(База!B:B,Статистика!B13,База!E:E,\"OK\")","v":4},{"$f":"CA3","v":"02:59:22.990"},10763,{"$f":"COUNTIFS(База!B:B,Статистика!B13,База!E:E,\"XXXX\")","v":0},{"$f":"IF(AX13+AZ13+BA13=0,ксекундвигре-BD13,ксекундвигре*Статистика!AX13+(ксекундвигре-Статистика!AZ13)+Статистика!BA13)","v":43537},65237,11,30]
[12,{"$f":"IF(ISERROR(VLOOKUP(A14,Служебный!B:C,2,0)),\"\",A14&\"-\"&VLOOKUP(A14,Служебный!B:C,2,0))","v":"12-Чистые лапки"},3,{"$f":"IF(ISERROR(VLOOKUP(CONCATENATE($B14,\"-\",C$1),База!$A:$G,5,0)),IF(ISERROR(VLOOKUP(CONCATENATE($B14,\"-\",C$1),'База выдачи'!$A:$F,5,0)),\"\",VLOOKUP(CONCATENATE($B14,\"-\",C$1),'База выдачи'!$A:$F,5,0)),VLOOKUP(CONCATENATE($B14,\"-\",C$1),База!$A:$G,5,0))","v":"OK"},{"$f":"IF(ISERROR(VLOOKUP(CONCATENATE($B14,\"-\",C$1),База!$A:$G,6,0)),IF(ISERROR(VLOOKUP(CONCATENATE($B14,\"-\",C$1),'База выдачи'!$A:$F,6,0)),\"\",VLOOKUP(CONCATENATE($B14,\"-\",C$1),'База выдачи'!$A:$F,6,0)),VLOOKUP(CONCATENATE($B14,\"-\",C$1),База!$A:$G,6,0))","v":"00:33:45.540"},1,{"$f":"IF(ISERROR(VLOOKUP(CONCATENATE($B14,\"-\",F$1),База!$A:$G,5,0)),IF(ISERROR(VLOOKUP(CONCATENATE($B14,\"-\",F$1),'База выдачи'!$A:$F,5,0)),\"\",VLOOKUP(CONCATENATE($B14,\"-\",F$1),'База выдачи'!$A:$F,5,0)),VLOOKUP(CONCATENATE($B14,\"-\",F$1),База!$A:$G,5,0))","v":"XXXX"},{"$f":"IF(ISERROR(VLOOKUP(CONCATENATE($B14,\"-\",F$1),База!$A:$G,6,0)),IF(ISERROR(VLOOKUP(CONCATENATE($B14,\"-\",F$1),'База выдачи'!$A:$F,6,0)),\"\",VLOOKUP(CONCATENATE($B14,\"-\",F$1),'База выдачи'!$A:$F,6,0)),VLOOKUP(CONCATENATE($B14,\"-\",F$1),База!$A:$G,6,0))","v":"01:21:28.510"},8,{"$f":"IF(ISERROR(VLOOKUP(CONCATENATE($B14,\"-\",I$1),База!$A:$G,5,0)),IF(ISERROR(VLOOKUP(CONCATENATE($B14,\"-\",I$1),'База выдачи'!$A:$F,5,0)),\"\",VLOOKUP(CONCATENATE($B14,\"-\",I$1),'База выдачи'!$A:$F,5,0)),VLOOKUP(CONCATENATE($B14,\"-\",I$1),База!$A:$G,5,0))","v":"OK"},{"$f":"IF(ISERROR(VLOOKUP(CONCATENATE($B14,\"-\",I$1),База!$A:$G,6,0)),IF(ISERROR(VLOOKUP(CONCATENATE($B14,\"-\",I$1),'База выдачи'!$A:$F,6,0)),\"\",VLOOKUP(CONCATENATE($B14,\"-\",I$1),'База выдачи'!$A:$F,6,0)),VLOOKUP(CONCATENATE($B14,\"-\",I$1),База!$A:$G,6,0))","v":"01:40:36.500"},6,{"$f":"IF(ISERROR(VLOOKUP(CONCATENATE($B14,\"-\",L$1),База!$A:$G,5,0)),IF(ISERROR(VLOOKUP(CONCATENATE($B14,\"-\",L$1),'База выдачи'!$A:$F,5,0)),\"\",VLOOKUP(CONCATENATE($B14,\"-\",L$1),'База выдачи'!$A:$F,5,0)),VLOOKUP(CONCATENATE($B14,\"-\",L$1),База!$A:$G,5,0))","v":"XXXX"},{"$f":"IF(ISERROR(VLOOKUP(CONCATENATE($B14,\"-\",L$1),База!$A:$G,6,0)),IF(ISERROR(VLOOKUP(CONCATENATE($B14,\"-\",L$1),'База выдачи'!$A:$F,6,0)),\"\",VLOOKUP(CONCATENATE($B14,\"-\",L$1),'База выдачи'!$A:$F,6,0)),VLOOKUP(CONCATENATE($B14,\"-\",L$1),База!$A:$G,6,0))","v":"02:21:22.100"},4,{"$f":"IF(ISERROR(VLOOKUP(CONCATENATE($B14,\"-\",O$1),База!$A:$G,5,0)),IF(ISERROR(VLOOKUP(CONCATENATE($B14,\"-\",O$1),'База выдачи'!$A:$F,5,0)),\"\",VLOOKUP(CONCATENATE($B14,\"-\",O$1),'База выдачи'!$A:$F,5,0)),VLOOKUP(CONCATENATE($B14,\"-\",O$1),База!$A:$G,5,0))","v":"OK"},{"$f":"IF(ISERROR(VLOOKUP(CONCATENATE($B14,\"-\",O$1),База!$A:$G,6,0)),IF(ISERROR(VLOOKUP(CONCATENATE($B14,\"-\",O$1),'База выдачи'!$A:$F,6,0)),\"\",VLOOKUP(CONCATENATE($B14,\"-\",O$1),'База выдачи'!$A:$F,6,0)),VLOOKUP(CONCATENATE($B14,\"-\",O$1),База!$A:$G,6,0))","v":"02:37:33.630"},5,{"$f":"IF(ISERROR(VLOOKUP(CONCATENATE($B14,\"-\",R$1),База!$A:$G,5,0)),IF(ISERROR(VLOOKUP(CONCATENATE($B14,\"-\",R$1),'База выдачи'!$A:$F,5,0)),\"\",VLOOKUP(CONCATENATE($B14,\"-\",R$1),'База выдачи'!$A:$F,5,0)),VLOOKUP(CONCATENATE($B14,\"-\",R$1),База!$A:$G,5,0))","v":"OK"},{"$f":"IF(ISERROR(VLOOKUP(CONCATENATE($B14,\"-\",R$1),База!$A:$G,6,0)),IF(ISERROR(VLOOKUP(CONCATENATE($B14,\"-\",R$1),'База выдачи'!$A:$F,6,0)),\"\",VLOOKUP(CONCATENATE($B14,\"-\",R$1),'База выдачи'!$A:$F,6,0)),VLOOKUP(CONCATENATE($B14,\"-\",R$1),База!$A:$G,6,0))","v":"02:52:56.950"},7,{"$f":"IF(ISERROR(VLOOKUP(CONCATENATE($B14,\"-\",U$1),База!$A:$G,5,0)),IF(ISERROR(VLOOKUP(CONCATENATE($B14,\"-\",U$1),'База выдачи'!$A:$F,5,0)),\"\",VLOOKUP(CONCATENATE($B14,\"-\",U$1),'База выдачи'!$A:$F,5,0)),VLOOKUP(CONCATENATE($B14,\"-\",U$1),База!$A:$G,5,0))","v":"OK"},{"$f":"IF(ISERROR(VLOOKUP(CONCATENATE($B14,\"-\",U$1),База!$A:$G,6,0)),IF(ISERROR(VLOOKUP(CONCATENATE($B14,\"-\",U$1),'База выдачи'!$A:$F,6,0)),\"\",VLOOKUP(CONCATENATE($B14,\"-\",U$1),'База выдачи'!$A:$F,6,0)),VLOOKUP(CONCATENATE($B14,\"-\",U$1),База!$A:$G,6,0))","v":"03:03:16.770"},9,{"$f":"IF(ISERROR(VLOOKUP(CONCATENATE($B14,\"-\",X$1),База!$A:$G,5,0)),IF(ISERROR(VLOOKUP(CONCATENATE($B14,\"-\",X$1),'База выдачи'!$A:$F,5,0)),\"\",VLOOKUP(CONCATENATE($B14,\"-\",X$1),'База выдачи'!$A:$F,5,0)),VLOOKUP(CONCATENATE($B14,\"-\",X$1),База!$A:$G,5,0))","v":"ST"},{"$f":"IF(ISERROR(VLOOKUP(CONCATENATE($B14,\"-\",X$1),База!$A:$G,6,0)),IF(ISERROR(VLOOKUP(CONCATENATE($B14,\"-\",X$1),'База выдачи'!$A:$F,6,0)),\"\",VLOOKUP(CONCATENATE($B14,\"-\",X$1),'База выдачи'!$A:$F,6,0)),VLOOKUP(CONCATENATE($B14,\"-\",X$1),База!$A:$G,6,0))","v":"03:03:18.720"},2,{"$f":"IF(ISERROR(VLOOKUP(CONCATENATE($B14,\"-\",AA$1),База!$A:$G,5,0)),IF(ISERROR(VLOOKUP(CONCATENATE($B14,\"-\",AA$1),'База выдачи'!$A:$F,5,0)),\"\",VLOOKUP(CONCATENATE($B14,\"-\",AA$1),'База выдачи'!$A:$F,5,0)),VLOOKUP(CONCATENATE($B14,\"-\",AA$1),База!$A:$G,5,0))","v":""},{"$f":"IF(ISERROR(VLOOKUP(CONCATENATE($B14,\"-\",AA$1),База!$A:$G,6,0)),IF(ISERROR(VLOOKUP(CONCATENATE($B14,\"-\",AA$1),'База выдачи'!$A:$F,6,0)),\"\",VLOOKUP(CONCATENATE($B14,\"-\",AA$1),'База выдачи'!$A:$F,6,0)),VLOOKUP(CONCATENATE($B14,\"-\",AA$1),База!$A:$G,6,0))","v":""},"N",{"$f":"IF(ISERROR(VLOOKUP(CONCATENATE($B14,\"-\",AD$1),База!$A:$G,5,0)),IF(ISERROR(VLOOKUP(CONCATENATE($B14,\"-\",AD$1),'База выдачи'!$A:$F,5,0)),\"\",VLOOKUP(CONCATENATE($B14,\"-\",AD$1),'База выдачи'!$A:$F,5,0)),VLOOKUP(CONCATENATE($B14,\"-\",AD$1),База!$A:$G,5,0))","v":""},{"$f":"IF(ISERROR(VLOOKUP(CONCATENATE($B14,\"-\",AD$1),База!$A:$G,6,0)),IF(ISERROR(VLOOKUP(CONCATENATE($B14,\"-\",AD$1),'База выдачи'!$A:$F,6,0)),\"\",VLOOKUP(CONCATENATE($B14,\"-\",AD$1),'База выдачи'!$A:$F,6,0)),VLOOKUP(CONCATENATE($B14,\"-\",AD$1),База!$A:$G,6,0))","v":""},"O",{"$f":"IF(ISERROR(VLOOKUP(CONCATENATE($B14,\"-\",AG$1),База!$A:$G,5,0)),IF(ISERROR(VLOOKUP(CONCATENATE($B14,\"-\",AG$1),'База выдачи'!$A:$F,5,0)),\"\",VLOOKUP(CONCATENATE($B14,\"-\",AG$1),'База выдачи'!$A:$F,5,0)),VLOOKUP(CONCATENATE($B14,\"-\",AG$1),База!$A:$G,5,0))","v":""},{"$f":"IF(ISERROR(VLOOKUP(CONCATENATE($B14,\"-\",AG$1),База!$A:$G,6,0)),IF(ISERROR(VLOOKUP(CONCATENATE($B14,\"-\",AG$1),'База выдачи'!$A:$F,6,0)),\"\",VLOOKUP(CONCATENATE($B14,\"-\",AG$1),'База выдачи'!$A:$F,6,0)),VLOOKUP(CONCATENATE($B14,\"-\",AG$1),База!$A:$G,6,0))","v":""},"A",{"$f":"IF(ISERROR(VLOOKUP(CONCATENATE($B14,\"-\",AJ$1),База!$A:$G,5,0)),IF(ISERROR(VLOOKUP(CONCATENATE($B14,\"-\",AJ$1),'База выдачи'!$A:$F,5,0)),\"\",VLOOKUP(CONCATENATE($B14,\"-\",AJ$1),'База выдачи'!$A:$F,5,0)),VLOOKUP(CONCATENATE($B14,\"-\",AJ$1),База!$A:$G,5,0))","v":""},{"$f":"IF(ISERROR(VLOOKUP(CONCATENATE($B14,\"-\",AJ$1),База!$A:$G,6,0)),IF(ISERROR(VLOOKUP(CONCATENATE($B14,\"-\",AJ$1),'База выдачи'!$A:$F,6,0)),\"\",VLOOKUP(CONCATENATE($B14,\"-\",AJ$1),'База выдачи'!$A:$F,6,0)),VLOOKUP(CONCATENATE($B14,\"-\",AJ$1),База!$A:$G,6,0))","v":""},"B",{"$f":"IF(ISERROR(VLOOKUP(CONCATENATE($B14,\"-\",AM$1),База!$A:$G,5,0)),IF(ISERROR(VLOOKUP(CONCATENATE($B14,\"-\",AM$1),'База выдачи'!$A:$F,5,0)),\"\",VLOOKUP(CONCATENATE($B14,\"-\",AM$1),'База выдачи'!$A:$F,5,0)),VLOOKUP(CONCATENATE($B14,\"-\",AM$1),База!$A:$G,5,0))","v":""},{"$f":"IF(ISERROR(VLOOKUP(CONCATENATE($B14,\"-\",AM$1),База!$A:$G,6,0)),IF(ISERROR(VLOOKUP(CONCATENATE($B14,\"-\",AM$1),'База выдачи'!$A:$F,6,0)),\"\",VLOOKUP(CONCATENATE($B14,\"-\",AM$1),'База выдачи'!$A:$F,6,0)),VLOOKUP(CONCATENATE($B14,\"-\",AM$1),База!$A:$G,6,0))","v":""},"C",{"$f":"IF(ISERROR(VLOOKUP(CONCATENATE($B14,\"-\",AP$1),База!$A:$G,5,0)),IF(ISERROR(VLOOKUP(CONCATENATE($B14,\"-\",AP$1),'База выдачи'!$A:$F,5,0)),\"\",VLOOKUP(CONCATENATE($B14,\"-\",AP$1),'База выдачи'!$A:$F,5,0)),VLOOKUP(CONCATENATE($B14,\"-\",AP$1),База!$A:$G,5,0))","v":""},{"$f":"IF(ISERROR(VLOOKUP(CONCATENATE($B14,\"-\",AP$1),База!$A:$G,6,0)),IF(ISERROR(VLOOKUP(CONCATENATE($B14,\"-\",AP$1),'База выдачи'!$A:$F,6,0)),\"\",VLOOKUP(CONCATENATE($B14,\"-\",AP$1),'База выдачи'!$A:$F,6,0)),VLOOKUP(CONCATENATE($B14,\"-\",AP$1),База!$A:$G,6,0))","v":""},"D",{"$f":"IF(ISERROR(VLOOKUP(CONCATENATE($B14,\"-\",AS$1),База!$A:$G,5,0)),IF(ISERROR(VLOOKUP(CONCATENATE($B14,\"-\",AS$1),'База выдачи'!$A:$F,5,0)),\"\",VLOOKUP(CONCATENATE($B14,\"-\",AS$1),'База выдачи'!$A:$F,5,0)),VLOOKUP(CONCATENATE($B14,\"-\",AS$1),База!$A:$G,5,0))","v":""},{"$f":"IF(ISERROR(VLOOKUP(CONCATENATE($B14,\"-\",AS$1),База!$A:$G,6,0)),IF(ISERROR(VLOOKUP(CONCATENATE($B14,\"-\",AS$1),'База выдачи'!$A:$F,6,0)),\"\",VLOOKUP(CONCATENATE($B14,\"-\",AS$1),'База выдачи'!$A:$F,6,0)),VLOOKUP(CONCATENATE($B14,\"-\",AS$1),База!$A:$G,6,0))","v":""},null,null,{"$f":"COUNTIFS(База!B:B,Статистика!B14,База!E:E,\"OK\")","v":5},{"$f":"CC3","v":"03:03:16.770"},10997,{"$f":"COUNTIFS(База!B:B,Статистика!B14,База!E:E,\"XXXX\")","v":2},{"$f":"IF(AX14+AZ14+BA14=0,ксекундвигре-BD14,ксекундвигре*Статистика!AX14+(ксекундвигре-Статистика!AZ14)+Статистика!BA14)","v":54165},65207,12,21]
[13,{"$f":"IF(ISERROR(VLOOKUP(A15,Служебный!B:C,2,0)),\"\",A15&\"-\"&VLOOKUP(A15,Служебный!B:C,2,0))","v":"13-Аьоке!"},4,{"$f":"IF(ISERROR(VLOOKUP(CONCATENATE($B15,\"-\",C$1),База!$A:$G,5,0)),IF(ISERROR(VLOOKUP(CONCATENATE($B15,\"-\",C$1),'База выдачи'!$A:$F,5,0)),\"\",VLOOKUP(CONCATENATE($B15,\"-\",C$1),'База выдачи'!$A:$F,5,0)),VLOOKUP(CONCATENATE($B15,\"-\",C$1),База!$A:$G,5,0))","v":"OK"},{"$f":"IF(ISERROR(VLOOKUP(CONCATENATE($B15,\"-\",C$1),База!$A:$G,6,0)),IF(ISERROR(VLOOKUP(CONCATENATE($B15,\"-\",C$1),'База выдачи'!$A:$F,6,0)),\"\",VLOOKUP(CONCATENATE($B15,\"-\",C$1),'База выдачи'!$A:$F,6,0)),VLOOKUP(CONCATENATE($B15,\"-\",C$1),База!$A:$G,6,0))","v":"00:56:26.790"},8,{"$f":"IF(ISERROR(VLOOKUP(CONCATENATE($B15,\"-\",F$1),База!$A:$G,5,0)),IF(ISERROR(VLOOKUP(CONCATENATE($B15,\"-\",F$1),'База выдачи'!$A:$F,5,0)),\"\",VLOOKUP(CONCATENATE($B15,\"-\",F$1),'База выдачи'!$A:$F,5,0)),VLOOKUP(CONCATENATE($B15,\"-\",F$1),База!$A:$G,5,0))","v":"OK"},{"$f":"IF(ISERROR(VLOOKUP(CONCATENATE($B15,\"-\",F$1),База!$A:$G,6,0)),IF(ISERROR(VLOOKUP(CONCATENATE($B15,\"-\",F$1),'База выдачи'!$A:$F,6,0)),\"\",VLOOKUP(CONCATENATE($B15,\"-\",F$1),'База выдачи'!$A:$F,6,0)),VLOOKUP(CONCATENATE($B15,\"-\",F$1),База!$A:$G,6,0))","v":"01:19:23.650"},5,{"$f":"IF(ISERROR(VLOOKUP(CONCATENATE($B15,\"-\",I$1),База!$A:$G,5,0)),IF(ISERROR(VLOOKUP(CONCATENATE($B15,\"-\",I$1),'База выдачи'!$A:$F,5,0)),\"\",VLOOKUP(CONCATENATE($B15,\"-\",I$1),'База выдачи'!$A:$F,5,0)),VLOOKUP(CONCATENATE($B15,\"-\",I$1),База!$A:$G,5,0))","v":"OK"},{"$f":"IF(ISERROR(VLOOKUP(CONCATENATE($B15,\"-\",I$1),База!$A:$G,6,0)),IF(ISERROR(VLOOKUP(CONCATENATE($B15,\"-\",I$1),'База выдачи'!$A:$F,6,0)),\"\",VLOOKUP(CONCATENATE($B15,\"-\",I$1),'База выдачи'!$A:$F,6,0)),VLOOKUP(CONCATENATE($B15,\"-\",I$1),База!$A:$G,6,0))","v":"01:50:37.370"},2,{"$f":"IF(ISERROR(VLOOKUP(CONCATENATE($B15,\"-\",L$1),База!$A:$G,5,0)),IF(ISERROR(VLOOKUP(CONCATENATE($B15,\"-\",L$1),'База выдачи'!$A:$F,5,0)),\"\",VLOOKUP(CONCATENATE($B15,\"-\",L$1),'База выдачи'!$A:$F,5,0)),VLOOKUP(CONCATENATE($B15,\"-\",L$1),База!$A:$G,5,0))","v":"OK"},{"$f":"IF(ISERROR(VLOOKUP(CONCATENATE($B15,\"-\",L$1),База!$A:$G,6,0)),IF(ISERROR(VLOOKUP(CONCATENATE($B15,\"-\",L$1),'База выдачи'!$A:$F,6,0)),\"\",VLOOKUP(CONCATENATE($B15,\"-\",L$1),'База выдачи'!$A:$F,6,0)),VLOOKUP(CONCATENATE($B15,\"-\",L$1),База!$A:$G,6,0))","v":"02:17:59.280"},3,{"$f":"IF(ISERROR(VLOOKUP(CONCATENATE($B15,\"-\",O$1),База!$A:$G,5,0)),IF(ISERROR(VLOOKUP(CONCATENATE($B15,\"-\",O$1),'База выдачи'!$A:$F,5,0)),\"\",VLOOKUP(CONCATENATE($B15,\"-\",O$1),'База выдачи'!$A:$F,5,0)),VLOOKUP(CONCATENATE($B15,\"-\",O$1),База!$A:$G,5,0))","v":"OK"},{"$f":"IF(ISERROR(VLOOKUP(CONCATENATE($B15,\"-\",O$1),База!$A:$G,6,0)),IF(ISERROR(VLOOKUP(CONCATENATE($B15,\"-\",O$1),'База выдачи'!$A:$F,6,0)),\"\",VLOOKUP(CONCATENATE($B15,\"-\",O$1),'База выдачи'!$A:$F,6,0)),VLOOKUP(CONCATENATE($B15,\"-\",O$1),База!$A:$G,6,0))","v":"02:30:45.230"},7,{"$f":"IF(ISERROR(VLOOKUP(CONCATENATE($B15,\"-\",R$1),База!$A:$G,5,0)),IF(ISERROR(VLOOKUP(CONCATENATE($B15,\"-\",R$1),'База выдачи'!$A:$F,5,0)),\"\",VLOOKUP(CONCATENATE($B15,\"-\",R$1),'База выдачи'!$A:$F,5,0)),VLOOKUP(CONCATENATE($B15,\"-\",R$1),База!$A:$G,5,0))","v":"OK"},{"$f":"IF(ISERROR(VLOOKUP(CONCATENATE($B15,\"-\",R$1),База!$A:$G,6,0)),IF(ISERROR(VLOOKUP(CONCATENATE($B15,\"-\",R$1),'База выдачи'!$A:$F,6,0)),\"\",VLOOKUP(CONCATENATE($B15,\"-\",R$1),'База выдачи'!$A:$F,6,0)),VLOOKUP(CONCATENATE($B15,\"-\",R$1),База!$A:$G,6,0))","v":"02:52:39.730"},9,{"$f":"IF(ISERROR(VLOOKUP(CONCATENATE($B15,\"-\",U$1),База!$A:$G,5,0)),IF(ISERROR(VLOOKUP(CONCATENATE($B15,\"-\",U$1),'База выдачи'!$A:$F,5,0)),\"\",VLOOKUP(CONCATENATE($B15,\"-\",U$1),'База выдачи'!$A:$F,5,0)),VLOOKUP(CONCATENATE($B15,\"-\",U$1),База!$A:$G,5,0))","v":"ST"},{"$f":"IF(ISERROR(VLOOKUP(CONCATENATE($B15,\"-\",U$1),База!$A:$G,6,0)),IF(ISERROR(VLOOKUP(CONCATENATE($B15,\"-\",U$1),'База выдачи'!$A:$F,6,0)),\"\",VLOOKUP(CONCATENATE($B15,\"-\",U$1),'База выдачи'!$A:$F,6,0)),VLOOKUP(CONCATENATE($B15,\"-\",U$1),База!$A:$G,6,0))","v":"02:52:41.650"},6,{"$f":"IF(ISERROR(VLOOKUP(CONCATENATE($B15,\"-\",X$1),База!$A:$G,5,0)),IF(ISERROR(VLOOKUP(CONCATENATE($B15,\"-\",X$1),'База выдачи'!$A:$F,5,0)),\"\",VLOOKUP(CONCATENATE($B15,\"-\",X$1),'База выдачи'!$A:$F,5,0)),VLOOKUP(CONCATENATE($B15,\"-\",X$1),База!$A:$G,5,0))","v":""},{"$f":"IF(ISERROR(VLOOKUP(CONCATENATE($B15,\"-\",X$1),База!$A:$G,6,0)),IF(ISERROR(VLOOKUP(CONCATENATE($B15,\"-\",X$1),'База выдачи'!$A:$F,6,0)),\"\",VLOOKUP(CONCATENATE($B15,\"-\",X$1),'База выдачи'!$A:$F,6,0)),VLOOKUP(CONCATENATE($B15,\"-\",X$1),База!$A:$G,6,0))","v":""},1,{"$f":"IF(ISERROR(VLOOKUP(CONCATENATE($B15,\"-\",AA$1),База!$A:$G,5,0)),IF(ISERROR(VLOOKUP(CONCATENATE($B15,\"-\",AA$1),'База выдачи'!$A:$F,5,0)),\"\",VLOOKUP(CONCATENATE($B15,\"-\",AA$1),'База выдачи'!$A:$F,5,0)),VLOOKUP(CONCATENATE($B15,\"-\",AA$1),База!$A:$G,5,0))","v":""},{"$f":"IF(ISERROR(VLOOKUP(CONCATENATE($B15,\"-\",AA$1),База!$A:$G,6,0)),IF(ISERROR(VLOOKUP(CONCATENATE($B15,\"-\",AA$1),'База выдачи'!$A:$F,6,0)),\"\",VLOOKUP(CONCATENATE($B15,\"-\",AA$1),'База выдачи'!$A:$F,6,0)),VLOOKUP(CONCATENATE($B15,\"-\",AA$1),База!$A:$G,6,0))","v":""},"M",{"$f":"IF(ISERROR(VLOOKUP(CONCATENATE($B15,\"-\",AD$1),База!$A:$G,5,0)),IF(ISERROR(VLOOKUP(CONCATENATE($B15,\"-\",AD$1),'База выдачи'!$A:$F,5,0)),\"\",VLOOKUP(CONCATENATE($B15,\"-\",AD$1),'База выдачи'!$A:$F,5,0)),VLOOKUP(CONCATENATE($B15,\"-\",AD$1),База!$A:$G,5,0))","v":""},{"$f":"IF(ISERROR(VLOOKUP(CONCATENATE($B15,\"-\",AD$1),База!$A:$G,6,0)),IF(ISERROR(VLOOKUP(CONCATENATE($B15,\"-\",AD$1),'База выдачи'!$A:$F,6,0)),\"\",VLOOKUP(CONCATENATE($B15,\"-\",AD$1),'База выдачи'!$A:$F,6,0)),VLOOKUP(CONCATENATE($B15,\"-\",AD$1),База!$A:$G,6,0))","v":""},"N",{"$f":"IF(ISERROR(VLOOKUP(CONCATENATE($B15,\"-\",AG$1),База!$A:$G,5,0)),IF(ISERROR(VLOOKUP(CONCATENATE($B15,\"-\",AG$1),'База выдачи'!$A:$F,5,0)),\"\",VLOOKUP(CONCATENATE($B15,\"-\",AG$1),'База выдачи'!$A:$F,5,0)),VLOOKUP(CONCATENATE($B15,\"-\",AG$1),База!$A:$G,5,0))","v":""},{"$f":"IF(ISERROR(VLOOKUP(CONCATENATE($B15,\"-\",AG$1),База!$A:$G,6,0)),IF(ISERROR(VLOOKUP(CONCATENATE($B15,\"-\",AG$1),'База выдачи'!$A:$F,6,0)),\"\",VLOOKUP(CONCATENATE($B15,\"-\",AG$1),'База выдачи'!$A:$F,6,0)),VLOOKUP(CONCATENATE($B15,\"-\",AG$1),База!$A:$G,6,0))","v":""},"O",{"$f":"IF(ISERROR(VLOOKUP(CONCATENATE($B15,\"-\",AJ$1),База!$A:$G,5,0)),IF(ISERROR(VLOOKUP(CONCATENATE($B15,\"-\",AJ$1),'База выдачи'!$A:$F,5,0)),\"\",VLOOKUP(CONCATENATE($B15,\"-\",AJ$1),'База выдачи'!$A:$F,5,0)),VLOOKUP(CONCATENATE($B15,\"-\",AJ$1),База!$A:$G,5,0))","v":""},{"$f":"IF(ISERROR(VLOOKUP(CONCATENATE($B15,\"-\",AJ$1),База!$A:$G,6,0)),IF(ISERROR(VLOOKUP(CONCATENATE($B15,\"-\",AJ$1),'База выдачи'!$A:$F,6,0)),\"\",VLOOKUP(CONCATENATE($B15,\"-\",AJ$1),'База выдачи'!$A:$F,6,0)),VLOOKUP(CONCATENATE($B15,\"-\",AJ$1),База!$A:$G,6,0))","v":""},"A",{"$f":"IF(ISERROR(VLOOKUP(CONCATENATE($B15,\"-\",AM$1),База!$A:$G,5,0)),IF(ISERROR(VLOOKUP(CONCATENATE($B15,\"-\",AM$1),'База выдачи'!$A:$F,5,0)),\"\",VLOOKUP(CONCATENATE($B15,\"-\",AM$1),'База выдачи'!$A:$F,5,0)),VLOOKUP(CONCATENATE($B15,\"-\",AM$1),База!$A:$G,5,0))","v":""},{"$f":"IF(ISERROR(VLOOKUP(CONCATENATE($B15,\"-\",AM$1),База!$A:$G,6,0)),IF(ISERROR(VLOOKUP(CONCATENATE($B15,\"-\",AM$1),'База выдачи'!$A:$F,6,0)),\"\",VLOOKUP(CONCATENATE($B15,\"-\",AM$1),'База выдачи'!$A:$F,6,0)),VLOOKUP(CONCATENATE($B15,\"-\",AM$1),База!$A:$G,6,0))","v":""},"B",{"$f":"IF(ISERROR(VLOOKUP(CONCATENATE($B15,\"-\",AP$1),База!$A:$G,5,0)),IF(ISERROR(VLOOKUP(CONCATENATE($B15,\"-\",AP$1),'База выдачи'!$A:$F,5,0)),\"\",VLOOKUP(CONCATENATE($B15,\"-\",AP$1),'База выдачи'!$A:$F,5,0)),VLOOKUP(CONCATENATE($B15,\"-\",AP$1),База!$A:$G,5,0))","v":""},{"$f":"IF(ISERROR(VLOOKUP(CONCATENATE($B15,\"-\",AP$1),База!$A:$G,6,0)),IF(ISERROR(VLOOKUP(CONCATENATE($B15,\"-\",AP$1),'База выдачи'!$A:$F,6,0)),\"\",VLOOKUP(CONCATENATE($B15,\"-\",AP$1),'База выдачи'!$A:$F,6,0)),VLOOKUP(CONCATENATE($B15,\"-\",AP$1),База!$A:$G,6,0))","v":""},"C",{"$f":"IF(ISERROR(VLOOKUP(CONCATENATE($B15,\"-\",AS$1),База!$A:$G,5,0)),IF(ISERROR(VLOOKUP(CONCATENATE($B15,\"-\",AS$1),'База выдачи'!$A:$F,5,0)),\"\",VLOOKUP(CONCATENATE($B15,\"-\",AS$1),'База выдачи'!$A:$F,5,0)),VLOOKUP(CONCATENATE($B15,\"-\",AS$1),База!$A:$G,5,0))","v":""},{"$f":"IF(ISERROR(VLOOKUP(CONCATENATE($B15,\"-\",AS$1),База!$A:$G,6,0)),IF(ISERROR(VLOOKUP(CONCATENATE($B15,\"-\",AS$1),'База выдачи'!$A:$F,6,0)),\"\",VLOOKUP(CONCATENATE($B15,\"-\",AS$1),'База выдачи'!$A:$F,6,0)),VLOOKUP(CONCATENATE($B15,\"-\",AS$1),База!$A:$G,6,0))","v":""},null,null,{"$f":"COUNTIFS(База!B:B,Статистика!B15,База!E:E,\"OK\")","v":6},{"$f":"CE3","v":"02:52:39.730"},10360,{"$f":"COUNTIFS(База!B:B,Статистика!B15,База!E:E,\"XXXX\")","v":0},{"$f":"IF(AX15+AZ15+BA15=0,ксекундвигре-BD15,ксекундвигре*Статистика!AX15+(ксекундвигре-Статистика!AZ15)+Статистика!BA15)","v":65660},65072,13,27]
[14,{"$f":"IF(ISERROR(VLOOKUP(A16,Служебный!B:C,2,0)),\"\",A16&\"-\"&VLOOKUP(A16,Служебный!B:C,2,0))","v":"14-Лева&Тигра"},5,{"$f":"IF(ISERROR(VLOOKUP(CONCATENATE($B16,\"-\",C$1),База!$A:$G,5,0)),IF(ISERROR(VLOOKUP(CONCATENATE($B16,\"-\",C$1),'База выдачи'!$A:$F,5,0)),\"\",VLOOKUP(CONCATENATE($B16,\"-\",C$1),'База выдачи'!$A:$F,5,0)),VLOOKUP(CONCATENATE($B16,\"-\",C$1),База!$A:$G,5,0))","v":"OK"},{"$f":"IF(ISERROR(VLOOKUP(CONCATENATE($B16,\"-\",C$1),База!$A:$G,6,0)),IF(ISERROR(VLOOKUP(CONCATENATE($B16,\"-\",C$1),'База выдачи'!$A:$F,6,0)),\"\",VLOOKUP(CONCATENATE($B16,\"-\",C$1),'База выдачи'!$A:$F,6,0)),VLOOKUP(CONCATENATE($B16,\"-\",C$1),База!$A:$G,6,0))","v":"01:08:03.520"},7,{"$f":"IF(ISERROR(VLOOKUP(CONCATENATE($B16,\"-\",F$1),База!$A:$G,5,0)),IF(ISERROR(VLOOKUP(CONCATENATE($B16,\"-\",F$1),'База выдачи'!$A:$F,5,0)),\"\",VLOOKUP(CONCATENATE($B16,\"-\",F$1),'База выдачи'!$A:$F,5,0)),VLOOKUP(CONCATENATE($B16,\"-\",F$1),База!$A:$G,5,0))","v":"OK"},{"$f":"IF(ISERROR(VLOOKUP(CONCATENATE($B16,\"-\",F$1),База!$A:$G,6,0)),IF(ISERROR(VLOOKUP(CONCATENATE($B16,\"-\",F$1),'База выдачи'!$A:$F,6,0)),\"\",VLOOKUP(CONCATENATE($B16,\"-\",F$1),'База выдачи'!$A:$F,6,0)),VLOOKUP(CONCATENATE($B16,\"-\",F$1),База!$A:$G,6,0))","v":"01:20:49.720"},1,{"$f":"IF(ISERROR(VLOOKUP(CONCATENATE($B16,\"-\",I$1),База!$A:$G,5,0)),IF(ISERROR(VLOOKUP(CONCATENATE($B16,\"-\",I$1),'База выдачи'!$A:$F,5,0)),\"\",VLOOKUP(CONCATENATE($B16,\"-\",I$1),'База выдачи'!$A:$F,5,0)),VLOOKUP(CONCATENATE($B16,\"-\",I$1),База!$A:$G,5,0))","v":"OK"},{"$f":"IF(ISERROR(VLOOKUP(CONCATENATE($B16,\"-\",I$1),База!$A:$G,6,0)),IF(ISERROR(VLOOKUP(CONCATENATE($B16,\"-\",I$1),'База выдачи'!$A:$F,6,0)),\"\",VLOOKUP(CONCATENATE($B16,\"-\",I$1),'База выдачи'!$A:$F,6,0)),VLOOKUP(CONCATENATE($B16,\"-\",I$1),База!$A:$G,6,0))","v":"02:28:11.470"},4,{"$f":"IF(ISERROR(VLOOKUP(CONCATENATE($B16,\"-\",L$1),База!$A:$G,5,0)),IF(ISERROR(VLOOKUP(CONCATENATE($B16,\"-\",L$1),'База выдачи'!$A:$F,5,0)),\"\",VLOOKUP(CONCATENATE($B16,\"-\",L$1),'База выдачи'!$A:$F,5,0)),VLOOKUP(CONCATENATE($B16,\"-\",L$1),База!$A:$G,5,0))","v":"ST"},{"$f":"IF(ISERROR(VLOOKUP(CONCATENATE($B16,\"-\",L$1),База!$A:$G,6,0)),IF(ISERROR(VLOOKUP(CONCATENATE($B16,\"-\",L$1),'База выдачи'!$A:$F,6,0)),\"\",VLOOKUP(CONCATENATE($B16,\"-\",L$1),'База выдачи'!$A:$F,6,0)),VLOOKUP(CONCATENATE($B16,\"-\",L$1),База!$A:$G,6,0))","v":"02:28:13.350"},9,{"$f":"IF(ISERROR(VLOOKUP(CONCATENATE($B16,\"-\",O$1),База!$A:$G,5,0)),IF(ISERROR(VLOOKUP(CONCATENATE($B16,\"-\",O$1),'База выдачи'!$A:$F,5,0)),\"\",VLOOKUP(CONCATENATE($B16,\"-\",O$1),'База выдачи'!$A:$F,5,0)),VLOOKUP(CONCATENATE($B16,\"-\",O$1),База!$A:$G,5,0))","v":""},{"$f":"IF(ISERROR(VLOOKUP(CONCATENATE($B16,\"-\",O$1),База!$A:$G,6,0)),IF(ISERROR(VLOOKUP(CONCATENATE($B16,\"-\",O$1),'База выдачи'!$A:$F,6,0)),\"\",VLOOKUP(CONCATENATE($B16,\"-\",O$1),'База выдачи'!$A:$F,6,0)),VLOOKUP(CONCATENATE($B16,\"-\",O$1),База!$A:$G,6,0))","v":""},6,{"$f":"IF(ISERROR(VLOOKUP(CONCATENATE($B16,\"-\",R$1),База!$A:$G,5,0)),IF(ISERROR(VLOOKUP(CONCATENATE($B16,\"-\",R$1),'База выдачи'!$A:$F,5,0)),\"\",VLOOKUP(CONCATENATE($B16,\"-\",R$1),'База выдачи'!$A:$F,5,0)),VLOOKUP(CONCATENATE($B16,\"-\",R$1),База!$A:$G,5,0))","v":""},{"$f":"IF(ISERROR(VLOOKUP(CONCATENATE($B16,\"-\",R$1),База!$A:$G,6,0)),IF(ISERROR(VLOOKUP(CONCATENATE($B16,\"-\",R$1),'База выдачи'!$A:$F,6,0)),\"\",VLOOKUP(CONCATENATE($B16,\"-\",R$1),'База выдачи'!$A:$F,6,0)),VLOOKUP(CONCATENATE($B16,\"-\",R$1),База!$A:$G,6,0))","v":""},8,{"$f":"IF(ISERROR(VLOOKUP(CONCATENATE($B16,\"-\",U$1),База!$A:$G,5,0)),IF(ISERROR(VLOOKUP(CONCATENATE($B16,\"-\",U$1),'База выдачи'!$A:$F,5,0)),\"\",VLOOKUP(CONCATENATE($B16,\"-\",U$1),'База выдачи'!$A:$F,5,0)),VLOOKUP(CONCATENATE($B16,\"-\",U$1),База!$A:$G,5,0))","v":""},{"$f":"IF(ISERROR(VLOOKUP(CONCATENATE($B16,\"-\",U$1),База!$A:$G,6,0)),IF(ISERROR(VLOOKUP(CONCATENATE($B16,\"-\",U$1),'База выдачи'!$A:$F,6,0)),\"\",VLOOKUP(CONCATENATE($B16,\"-\",U$1),'База выдачи'!$A:$F,6,0)),VLOOKUP(CONCATENATE($B16,\"-\",U$1),База!$A:$G,6,0))","v":""},2,{"$f":"IF(ISERROR(VLOOKUP(CONCATENATE($B16,\"-\",X$1),База!$A:$G,5,0)),IF(ISERROR(VLOOKUP(CONCATENATE($B16,\"-\",X$1),'База выдачи'!$A:$F,5,0)),\"\",VLOOKUP(CONCATENATE($B16,\"-\",X$1),'База выдачи'!$A:$F,5,0)),VLOOKUP(CONCATENATE($B16,\"-\",X$1),База!$A:$G,5,0))","v":""},{"$f":"IF(ISERROR(VLOOKUP(CONCATENATE($B16,\"-\",X$1),База!$A:$G,6,0)),IF(ISERROR(VLOOKUP(CONCATENATE($B16,\"-\",X$1),'База выдачи'!$A:$F,6,0)),\"\",VLOOKUP(CONCATENATE($B16,\"-\",X$1),'База выдачи'!$A:$F,6,0)),VLOOKUP(CONCATENATE($B16,\"-\",X$1),База!$A:$G,6,0))","v":""},3,{"$f":"IF(ISERROR(VLOOKUP(CONCATENATE($B16,\"-\",AA$1),База!$A:$G,5,0)),IF(ISERROR(VLOOKUP(CONCATENATE($B16,\"-\",AA$1),'База выдачи'!$A:$F,5,0)),\"\",VLOOKUP(CONCATENATE($B16,\"-\",AA$1),'База выдачи'!$A:$F,5,0)),VLOOKUP(CONCATENATE($B16,\"-\",AA$1),База!$A:$G,5,0))","v":""},{"$f":"IF(ISERROR(VLOOKUP(CONCATENATE($B16,\"-\",AA$1),База!$A:$G,6,0)),IF(ISERROR(VLOOKUP(CONCATENATE($B16,\"-\",AA$1),'База выдачи'!$A:$F,6,0)),\"\",VLOOKUP(CONCATENATE($B16,\"-\",AA$1),'База выдачи'!$A:$F,6,0)),VLOOKUP(CONCATENATE($B16,\"-\",AA$1),База!$A:$G,6,0))","v":""},"L",{"$f":"IF(ISERROR(VLOOKUP(CONCATENATE($B16,\"-\",AD$1),База!$A:$G,5,0)),IF(ISERROR(VLOOKUP(CONCATENATE($B16,\"-\",AD$1),'База выдачи'!$A:$F,5,0)),\"\",VLOOKUP(CONCATENATE($B16,\"-\",AD$1),'База выдачи'!$A:$F,5,0)),VLOOKUP(CONCATENATE($B16,\"-\",AD$1),База!$A:$G,5,0))","v":""},{"$f":"IF(ISERROR(VLOOKUP(CONCATENATE($B16,\"-\",AD$1),База!$A:$G,6,0)),IF(ISERROR(VLOOKUP(CONCATENATE($B16,\"-\",AD$1),'База выдачи'!$A:$F,6,0)),\"\",VLOOKUP(CONCATENATE($B16,\"-\",AD$1),'База выдачи'!$A:$F,6,0)),VLOOKUP(CONCATENATE($B16,\"-\",AD$1),База!$A:$G,6,0))","v":""},"M",{"$f":"IF(ISERROR(VLOOKUP(CONCATENATE($B16,\"-\",AG$1),База!$A:$G,5,0)),IF(ISERROR(VLOOKUP(CONCATENATE($B16,\"-\",AG$1),'База выдачи'!$A:$F,5,0)),\"\",VLOOKUP(CONCATENATE($B16,\"-\",AG$1),'База выдачи'!$A:$F,5,0)),VLOOKUP(CONCATENATE($B16,\"-\",AG$1),База!$A:$G,5,0))","v":""},{"$f":"IF(ISERROR(VLOOKUP(CONCATENATE($B16,\"-\",AG$1),База!$A:$G,6,0)),IF(ISERROR(VLOOKUP(CONCATENATE($B16,\"-\",AG$1),'База выдачи'!$A:$F,6,0)),\"\",VLOOKUP(CONCATENATE($B16,\"-\",AG$1),'База выдачи'!$A:$F,6,0)),VLOOKUP(CONCATENATE($B16,\"-\",AG$1),База!$A:$G,6,0))","v":""},"N",{"$f":"IF(ISERROR(VLOOKUP(CONCATENATE($B16,\"-\",AJ$1),База!$A:$G,5,0)),IF(ISERROR(VLOOKUP(CONCATENATE($B16,\"-\",AJ$1),'База выдачи'!$A:$F,5,0)),\"\",VLOOKUP(CONCATENATE($B16,\"-\",AJ$1),'База выдачи'!$A:$F,5,0)),VLOOKUP(CONCATENATE($B16,\"-\",AJ$1),База!$A:$G,5,0))","v":""},{"$f":"IF(ISERROR(VLOOKUP(CONCATENATE($B16,\"-\",AJ$1),База!$A:$G,6,0)),IF(ISERROR(VLOOKUP(CONCATENATE($B16,\"-\",AJ$1),'База выдачи'!$A:$F,6,0)),\"\",VLOOKUP(CONCATENATE($B16,\"-\",AJ$1),'База выдачи'!$A:$F,6,0)),VLOOKUP(CONCATENATE($B16,\"-\",AJ$1),База!$A:$G,6,0))","v":""},"O",{"$f":"IF(ISERROR(VLOOKUP(CONCATENATE($B16,\"-\",AM$1),База!$A:$G,5,0)),IF(ISERROR(VLOOKUP(CONCATENATE($B16,\"-\",AM$1),'База выдачи'!$A:$F,5,0)),\"\",VLOOKUP(CONCATENATE($B16,\"-\",AM$1),'База выдачи'!$A:$F,5,0)),VLOOKUP(CONCATENATE($B16,\"-\",AM$1),База!$A:$G,5,0))","v":""},{"$f":"IF(ISERROR(VLOOKUP(CONCATENATE($B16,\"-\",AM$1),База!$A:$G,6,0)),IF(ISERROR(VLOOKUP(CONCATENATE($B16,\"-\",AM$1),'База выдачи'!$A:$F,6,0)),\"\",VLOOKUP(CONCATENATE($B16,\"-\",AM$1),'База выдачи'!$A:$F,6,0)),VLOOKUP(CONCATENATE($B16,\"-\",AM$1),База!$A:$G,6,0))","v":""},"A",{"$f":"IF(ISERROR(VLOOKUP(CONCATENATE($B16,\"-\",AP$1),База!$A:$G,5,0)),IF(ISERROR(VLOOKUP(CONCATENATE($B16,\"-\",AP$1),'База выдачи'!$A:$F,5,0)),\"\",VLOOKUP(CONCATENATE($B16,\"-\",AP$1),'База выдачи'!$A:$F,5,0)),VLOOKUP(CONCATENATE($B16,\"-\",AP$1),База!$A:$G,5,0))","v":""},{"$f":"IF(ISERROR(VLOOKUP(CONCATENATE($B16,\"-\",AP$1),База!$A:$G,6,0)),IF(ISERROR(VLOOKUP(CONCATENATE($B16,\"-\",AP$1),'База выдачи'!$A:$F,6,0)),\"\",VLOOKUP(CONCATENATE($B16,\"-\",AP$1),'База выдачи'!$A:$F,6,0)),VLOOKUP(CONCATENATE($B16,\"-\",AP$1),База!$A:$G,6,0))","v":""},"B",{"$f":"IF(ISERROR(VLOOKUP(CONCATENATE($B16,\"-\",AS$1),База!$A:$G,5,0)),IF(ISERROR(VLOOKUP(CONCATENATE($B16,\"-\",AS$1),'База выдачи'!$A:$F,5,0)),\"\",VLOOKUP(CONCATENATE($B16,\"-\",AS$1),'База выдачи'!$A:$F,5,0)),VLOOKUP(CONCATENATE($B16,\"-\",AS$1),База!$A:$G,5,0))","v":""},{"$f":"IF(ISERROR(VLOOKUP(CONCATENATE($B16,\"-\",AS$1),База!$A:$G,6,0)),IF(ISERROR(VLOOKUP(CONCATENATE($B16,\"-\",AS$1),'База выдачи'!$A:$F,6,0)),\"\",VLOOKUP(CONCATENATE($B16,\"-\",AS$1),'База выдачи'!$A:$F,6,0)),VLOOKUP(CONCATENATE($B16,\"-\",AS$1),База!$A:$G,6,0))","v":""},null,null,{"$f":"COUNTIFS(База!B:B,Статистика!B16,База!E:E,\"OK\")","v":3},{"$f":"CG3","v":"02:28:11.470"},8891,{"$f":"COUNTIFS(База!B:B,Статистика!B16,База!E:E,\"XXXX\")","v":0},{"$f":"IF(AX16+AZ16+BA16=0,ксекундвигре-BD16,ксекундвигре*Статистика!AX16+(ксекундвигре-Статистика!AZ16)+Статистика!BA16)","v":34549},58685,14,22]
[15,{"$f":"IF(ISERROR(VLOOKUP(A17,Служебный!B:C,2,0)),\"\",A17&\"-\"&VLOOKUP(A17,Служебный!B:C,2,0))","v":"15-Нефть"},6,{"$f":"IF(ISERROR(VLOOKUP(CONCATENATE($B17,\"-\",C$1),База!$A:$G,5,0)),IF(ISERROR(VLOOKUP(CONCATENATE($B17,\"-\",C$1),'База выдачи'!$A:$F,5,0)),\"\",VLOOKUP(CONCATENATE($B17,\"-\",C$1),'База выдачи'!$A:$F,5,0)),VLOOKUP(CONCATENATE($B17,\"-\",C$1),База!$A:$G,5,0))","v":"OK"},{"$f":"IF(ISERROR(VLOOKUP(CONCATENATE($B17,\"-\",C$1),База!$A:$G,6,0)),IF(ISERROR(VLOOKUP(CONCATENATE($B17,\"-\",C$1),'База выдачи'!$A:$F,6,0)),\"\",VLOOKUP(CONCATENATE($B17,\"-\",C$1),'База выдачи'!$A:$F,6,0)),VLOOKUP(CONCATENATE($B17,\"-\",C$1),База!$A:$G,6,0))","v":"00:30:23.050"},9,{"$f":"IF(ISERROR(VLOOKUP(CONCATENATE($B17,\"-\",F$1),База!$A:$G,5,0)),IF(ISERROR(VLOOKUP(CONCATENATE($B17,\"-\",F$1),'База выдачи'!$A:$F,5,0)),\"\",VLOOKUP(CONCATENATE($B17,\"-\",F$1),'База выдачи'!$A:$F,5,0)),VLOOKUP(CONCATENATE($B17,\"-\",F$1),База!$A:$G,5,0))","v":"OK"},{"$f":"IF(ISERROR(VLOOKUP(CONCATENATE($B17,\"-\",F$1),База!$A:$G,6,0)),IF(ISERROR(VLOOKUP(CONCATENATE($B17,\"-\",F$1),'База выдачи'!$A:$F,6,0)),\"\",VLOOKUP(CONCATENATE($B17,\"-\",F$1),'База выдачи'!$A:$F,6,0)),VLOOKUP(CONCATENATE($B17,\"-\",F$1),База!$A:$G,6,0))","v":"00:35:52.490"},4,{"$f":"IF(ISERROR(VLOOKUP(CONCATENATE($B17,\"-\",I$1),База!$A:$G,5,0)),IF(ISERROR(VLOOKUP(CONCATENATE($B17,\"-\",I$1),'База выдачи'!$A:$F,5,0)),\"\",VLOOKUP(CONCATENATE($B17,\"-\",I$1),'База выдачи'!$A:$F,5,0)),VLOOKUP(CONCATENATE($B17,\"-\",I$1),База!$A:$G,5,0))","v":"OK"},{"$f":"IF(ISERROR(VLOOKUP(CONCATENATE($B17,\"-\",I$1),База!$A:$G,6,0)),IF(ISERROR(VLOOKUP(CONCATENATE($B17,\"-\",I$1),'База выдачи'!$A:$F,6,0)),\"\",VLOOKUP(CONCATENATE($B17,\"-\",I$1),'База выдачи'!$A:$F,6,0)),VLOOKUP(CONCATENATE($B17,\"-\",I$1),База!$A:$G,6,0))","v":"00:51:45.450"},5,{"$f":"IF(ISERROR(VLOOKUP(CONCATENATE($B17,\"-\",L$1),База!$A:$G,5,0)),IF(ISERROR(VLOOKUP(CONCATENATE($B17,\"-\",L$1),'База выдачи'!$A:$F,5,0)),\"\",VLOOKUP(CONCATENATE($B17,\"-\",L$1),'База выдачи'!$A:$F,5,0)),VLOOKUP(CONCATENATE($B17,\"-\",L$1),База!$A:$G,5,0))","v":"OK"},{"$f":"IF(ISERROR(VLOOKUP(CONCATENATE($B17,\"-\",L$1),База!$A:$G,6,0)),IF(ISERROR(VLOOKUP(CONCATENATE($B17,\"-\",L$1),'База выдачи'!$A:$F,6,0)),\"\",VLOOKUP(CONCATENATE($B17,\"-\",L$1),'База выдачи'!$A:$F,6,0)),VLOOKUP(CONCATENATE($B17,\"-\",L$1),База!$A:$G,6,0))","v":"01:03:24.240"},8,{"$f":"IF(ISERROR(VLOOKUP(CONCATENATE($B17,\"-\",O$1),База!$A:$G,5,0)),IF(ISERROR(VLOOKUP(CONCATENATE($B17,\"-\",O$1),'База выдачи'!$A:$F,5,0)),\"\",VLOOKUP(CONCATENATE($B17,\"-\",O$1),'База выдачи'!$A:$F,5,0)),VLOOKUP(CONCATENATE($B17,\"-\",O$1),База!$A:$G,5,0))","v":"OK"},{"$f":"IF(ISERROR(VLOOKUP(CONCATENATE($B17,\"-\",O$1),База!$A:$G,6,0)),IF(ISERROR(VLOOKUP(CONCATENATE($B17,\"-\",O$1),'База выдачи'!$A:$F,6,0)),\"\",VLOOKUP(CONCATENATE($B17,\"-\",O$1),'База выдачи'!$A:$F,6,0)),VLOOKUP(CONCATENATE($B17,\"-\",O$1),База!$A:$G,6,0))","v":"01:23:57.060"},2,{"$f":"IF(ISERROR(VLOOKUP(CONCATENATE($B17,\"-\",R$1),База!$A:$G,5,0)),IF(ISERROR(VLOOKUP(CONCATENATE($B17,\"-\",R$1),'База выдачи'!$A:$F,5,0)),\"\",VLOOKUP(CONCATENATE($B17,\"-\",R$1),'База выдачи'!$A:$F,5,0)),VLOOKUP(CONCATENATE($B17,\"-\",R$1),База!$A:$G,5,0))","v":"XXXX"},{"$f":"IF(ISERROR(VLOOKUP(CONCATENATE($B17,\"-\",R$1),База!$A:$G,6,0)),IF(ISERROR(VLOOKUP(CONCATENATE($B17,\"-\",R$1),'База выдачи'!$A:$F,6,0)),\"\",VLOOKUP(CONCATENATE($B17,\"-\",R$1),'База выдачи'!$A:$F,6,0)),VLOOKUP(CONCATENATE($B17,\"-\",R$1),База!$A:$G,6,0))","v":"02:06:09.580"},1,{"$f":"IF(ISERROR(VLOOKUP(CONCATENATE($B17,\"-\",U$1),База!$A:$G,5,0)),IF(ISERROR(VLOOKUP(CONCATENATE($B17,\"-\",U$1),'База выдачи'!$A:$F,5,0)),\"\",VLOOKUP(CONCATENATE($B17,\"-\",U$1),'База выдачи'!$A:$F,5,0)),VLOOKUP(CONCATENATE($B17,\"-\",U$1),База!$A:$G,5,0))","v":"OK"},{"$f":"IF(ISERROR(VLOOKUP(CONCATENATE($B17,\"-\",U$1),База!$A:$G,6,0)),IF(ISERROR(VLOOKUP(CONCATENATE($B17,\"-\",U$1),'База выдачи'!$A:$F,6,0)),\"\",VLOOKUP(CONCATENATE($B17,\"-\",U$1),'База выдачи'!$A:$F,6,0)),VLOOKUP(CONCATENATE($B17,\"-\",U$1),База!$A:$G,6,0))","v":"02:57:56.530"},3,{"$f":"IF(ISERROR(VLOOKUP(CONCATENATE($B17,\"-\",X$1),База!$A:$G,5,0)),IF(ISERROR(VLOOKUP(CONCATENATE($B17,\"-\",X$1),'База выдачи'!$A:$F,5,0)),\"\",VLOOKUP(CONCATENATE($B17,\"-\",X$1),'База выдачи'!$A:$F,5,0)),VLOOKUP(CONCATENATE($B17,\"-\",X$1),База!$A:$G,5,0))","v":"ST"},{"$f":"IF(ISERROR(VLOOKUP(CONCATENATE($B17,\"-\",X$1),База!$A:$G,6,0)),IF(ISERROR(VLOOKUP(CONCATENATE($B17,\"-\",X$1),'База выдачи'!$A:$F,6,0)),\"\",VLOOKUP(CONCATENATE($B17,\"-\",X$1),'База выдачи'!$A:$F,6,0)),VLOOKUP(CONCATENATE($B17,\"-\",X$1),База!$A:$G,6,0))","v":"02:57:58.470"},7,{"$f":"IF(ISERROR(VLOOKUP(CONCATENATE($B17,\"-\",AA$1),База!$A:$G,5,0)),IF(ISERROR(VLOOKUP(CONCATENATE($B17,\"-\",AA$1),'База выдачи'!$A:$F,5,0)),\"\",VLOOKUP(CONCATENATE($B17,\"-\",AA$1),'База выдачи'!$A:$F,5,0)),VLOOKUP(CONCATENATE($B17,\"-\",AA$1),База!$A:$G,5,0))","v":""},{"$f":"IF(ISERROR(VLOOKUP(CONCATENATE($B17,\"-\",AA$1),База!$A:$G,6,0)),IF(ISERROR(VLOOKUP(CONCATENATE($B17,\"-\",AA$1),'База выдачи'!$A:$F,6,0)),\"\",VLOOKUP(CONCATENATE($B17,\"-\",AA$1),'База выдачи'!$A:$F,6,0)),VLOOKUP(CONCATENATE($B17,\"-\",AA$1),База!$A:$G,6,0))","v":""},"K",{"$f":"IF(ISERROR(VLOOKUP(CONCATENATE($B17,\"-\",AD$1),База!$A:$G,5,0)),IF(ISERROR(VLOOKUP(CONCATENATE($B17,\"-\",AD$1),'База выдачи'!$A:$F,5,0)),\"\",VLOOKUP(CONCATENATE($B17,\"-\",AD$1),'База выдачи'!$A:$F,5,0)),VLOOKUP(CONCATENATE($B17,\"-\",AD$1),База!$A:$G,5,0))","v":""},{"$f":"IF(ISERROR(VLOOKUP(CONCATENATE($B17,\"-\",AD$1),База!$A:$G,6,0)),IF(ISERROR(VLOOKUP(CONCATENATE($B17,\"-\",AD$1),'База выдачи'!$A:$F,6,0)),\"\",VLOOKUP(CONCATENATE($B17,\"-\",AD$1),'База выдачи'!$A:$F,6,0)),VLOOKUP(CONCATENATE($B17,\"-\",AD$1),База!$A:$G,6,0))","v":""},"L",{"$f":"IF(ISERROR(VLOOKUP(CONCATENATE($B17,\"-\",AG$1),База!$A:$G,5,0)),IF(ISERROR(VLOOKUP(CONCATENATE($B17,\"-\",AG$1),'База выдачи'!$A:$F,5,0)),\"\",VLOOKUP(CONCATENATE($B17,\"-\",AG$1),'База выдачи'!$A:$F,5,0)),VLOOKUP(CONCATENATE($B17,\"-\",AG$1),База!$A:$G,5,0))","v":""},{"$f":"IF(ISERROR(VLOOKUP(CONCATENATE($B17,\"-\",AG$1),База!$A:$G,6,0)),IF(ISERROR(VLOOKUP(CONCATENATE($B17,\"-\",AG$1),'База выдачи'!$A:$F,6,0)),\"\",VLOOKUP(CONCATENATE($B17,\"-\",AG$1),'База выдачи'!$A:$F,6,0)),VLOOKUP(CONCATENATE($B17,\"-\",AG$1),База!$A:$G,6,0))","v":""},"M",{"$f":"IF(ISERROR(VLOOKUP(CONCATENATE($B17,\"-\",AJ$1),База!$A:$G,5,0)),IF(ISERROR(VLOOKUP(CONCATENATE($B17,\"-\",AJ$1),'База выдачи'!$A:$F,5,0)),\"\",VLOOKUP(CONCATENATE($B17,\"-\",AJ$1),'База выдачи'!$A:$F,5,0)),VLOOKUP(CONCATENATE($B17,\"-\",AJ$1),База!$A:$G,5,0))","v":""},{"$f":"IF(ISERROR(VLOOKUP(CONCATENATE($B17,\"-\",AJ$1),База!$A:$G,6,0)),IF(ISERROR(VLOOKUP(CONCATENATE($B17,\"-\",AJ$1),'База выдачи'!$A:$F,6,0)),\"\",VLOOKUP(CONCATENATE($B17,\"-\",AJ$1),'База выдачи'!$A:$F,6,0)),VLOOKUP(CONCATENATE($B17,\"-\",AJ$1),База!$A:$G,6,0))","v":""},"N",{"$f":"IF(ISERROR(VLOOKUP(CONCATENATE($B17,\"-\",AM$1),База!$A:$G,5,0)),IF(ISERROR(VLOOKUP(CONCATENATE($B17,\"-\",AM$1),'База выдачи'!$A:$F,5,0)),\"\",VLOOKUP(CONCATENATE($B17,\"-\",AM$1),'База выдачи'!$A:$F,5,0)),VLOOKUP(CONCATENATE($B17,\"-\",AM$1),База!$A:$G,5,0))","v":""},{"$f":"IF(ISERROR(VLOOKUP(CONCATENATE($B17,\"-\",AM$1),База!$A:$G,6,0)),IF(ISERROR(VLOOKUP(CONCATENATE($B17,\"-\",AM$1),'База выдачи'!$A:$F,6,0)),\"\",VLOOKUP(CONCATENATE($B17,\"-\",AM$1),'База выдачи'!$A:$F,6,0)),VLOOKUP(CONCATENATE($B17,\"-\",AM$1),База!$A:$G,6,0))","v":""},"O",{"$f":"IF(ISERROR(VLOOKUP(CONCATENATE($B17,\"-\",AP$1),База!$A:$G,5,0)),IF(ISERROR(VLOOKUP(CONCATENATE($B17,\"-\",AP$1),'База выдачи'!$A:$F,5,0)),\"\",VLOOKUP(CONCATENATE($B17,\"-\",AP$1),'База выдачи'!$A:$F,5,0)),VLOOKUP(CONCATENATE($B17,\"-\",AP$1),База!$A:$G,5,0))","v":""},{"$f":"IF(ISERROR(VLOOKUP(CONCATENATE($B17,\"-\",AP$1),База!$A:$G,6,0)),IF(ISERROR(VLOOKUP(CONCATENATE($B17,\"-\",AP$1),'База выдачи'!$A:$F,6,0)),\"\",VLOOKUP(CONCATENATE($B17,\"-\",AP$1),'База выдачи'!$A:$F,6,0)),VLOOKUP(CONCATENATE($B17,\"-\",AP$1),База!$A:$G,6,0))","v":""},"A",{"$f":"IF(ISERROR(VLOOKUP(CONCATENATE($B17,\"-\",AS$1),База!$A:$G,5,0)),IF(ISERROR(VLOOKUP(CONCATENATE($B17,\"-\",AS$1),'База выдачи'!$A:$F,5,0)),\"\",VLOOKUP(CONCATENATE($B17,\"-\",AS$1),'База выдачи'!$A:$F,5,0)),VLOOKUP(CONCATENATE($B17,\"-\",AS$1),База!$A:$G,5,0))","v":""},{"$f":"IF(ISERROR(VLOOKUP(CONCATENATE($B17,\"-\",AS$1),База!$A:$G,6,0)),IF(ISERROR(VLOOKUP(CONCATENATE($B17,\"-\",AS$1),'База выдачи'!$A:$F,6,0)),\"\",VLOOKUP(CONCATENATE($B17,\"-\",AS$1),'База выдачи'!$A:$F,6,0)),VLOOKUP(CONCATENATE($B17,\"-\",AS$1),База!$A:$G,6,0))","v":""},null,null,{"$f":"COUNTIFS(База!B:B,Статистика!B17,База!E:E,\"OK\")","v":6},{"$f":"CI3","v":"02:57:56.530"},10677,{"$f":"COUNTIFS(База!B:B,Статистика!B17,База!E:E,\"XXXX\")","v":1},{"$f":"IF(AX17+AZ17+BA17=0,ксекундвигре-BD17,ксекундвигре*Статистика!AX17+(ксекундвигре-Статистика!AZ17)+Статистика!BA17)","v":65344},55652,15,8]
[16,{"$f":"IF(ISERROR(VLOOKUP(A18,Служебный!B:C,2,0)),\"\",A18&\"-\"&VLOOKUP(A18,Служебный!B:C,2,0))","v":"16-Коты"},7,{"$f":"IF(ISERROR(VLOOKUP(CONCATENATE($B18,\"-\",C$1),База!$A:$G,5,0)),IF(ISERROR(VLOOKUP(CONCATENATE($B18,\"-\",C$1),'База выдачи'!$A:$F,5,0)),\"\",VLOOKUP(CONCATENATE($B18,\"-\",C$1),'База выдачи'!$A:$F,5,0)),VLOOKUP(CONCATENATE($B18,\"-\",C$1),База!$A:$G,5,0))","v":"OK"},{"$f":"IF(ISERROR(VLOOKUP(CONCATENATE($B18,\"-\",C$1),База!$A:$G,6,0)),IF(ISERROR(VLOOKUP(CONCATENATE($B18,\"-\",C$1),'База выдачи'!$A:$F,6,0)),\"\",VLOOKUP(CONCATENATE($B18,\"-\",C$1),'База выдачи'!$A:$F,6,0)),VLOOKUP(CONCATENATE($B18,\"-\",C$1),База!$A:$G,6,0))","v":"00:25:41.500"},3,{"$f":"IF(ISERROR(VLOOKUP(CONCATENATE($B18,\"-\",F$1),База!$A:$G,5,0)),IF(ISERROR(VLOOKUP(CONCATENATE($B18,\"-\",F$1),'База выдачи'!$A:$F,5,0)),\"\",VLOOKUP(CONCATENATE($B18,\"-\",F$1),'База выдачи'!$A:$F,5,0)),VLOOKUP(CONCATENATE($B18,\"-\",F$1),База!$A:$G,5,0))","v":"OK"},{"$f":"IF(ISERROR(VLOOKUP(CONCATENATE($B18,\"-\",F$1),База!$A:$G,6,0)),IF(ISERROR(VLOOKUP(CONCATENATE($B18,\"-\",F$1),'База выдачи'!$A:$F,6,0)),\"\",VLOOKUP(CONCATENATE($B18,\"-\",F$1),'База выдачи'!$A:$F,6,0)),VLOOKUP(CONCATENATE($B18,\"-\",F$1),База!$A:$G,6,0))","v":"00:38:06.460"},9,{"$f":"IF(ISERROR(VLOOKUP(CONCATENATE($B18,\"-\",I$1),База!$A:$G,5,0)),IF(ISERROR(VLOOKUP(CONCATENATE($B18,\"-\",I$1),'База выдачи'!$A:$F,5,0)),\"\",VLOOKUP(CONCATENATE($B18,\"-\",I$1),'База выдачи'!$A:$F,5,0)),VLOOKUP(CONCATENATE($B18,\"-\",I$1),База!$A:$G,5,0))","v":"OK"},{"$f":"IF(ISERROR(VLOOKUP(CONCATENATE($B18,\"-\",I$1),База!$A:$G,6,0)),IF(ISERROR(VLOOKUP(CONCATENATE($B18,\"-\",I$1),'База выдачи'!$A:$F,6,0)),\"\",VLOOKUP(CONCATENATE($B18,\"-\",I$1),'База выдачи'!$A:$F,6,0)),VLOOKUP(CONCATENATE($B18,\"-\",I$1),База!$A:$G,6,0))","v":"00:59:41.230"},1,{"$f":"IF(ISERROR(VLOOKUP(CONCATENATE($B18,\"-\",L$1),База!$A:$G,5,0)),IF(ISERROR(VLOOKUP(CONCATENATE($B18,\"-\",L$1),'База выдачи'!$A:$F,5,0)),\"\",VLOOKUP(CONCATENATE($B18,\"-\",L$1),'База выдачи'!$A:$F,5,0)),VLOOKUP(CONCATENATE($B18,\"-\",L$1),База!$A:$G,5,0))","v":"XXXX"},{"$f":"IF(ISERROR(VLOOKUP(CONCATENATE($B18,\"-\",L$1),База!$A:$G,6,0)),IF(ISERROR(VLOOKUP(CONCATENATE($B18,\"-\",L$1),'База выдачи'!$A:$F,6,0)),\"\",VLOOKUP(CONCATENATE($B18,\"-\",L$1),'База выдачи'!$A:$F,6,0)),VLOOKUP(CONCATENATE($B18,\"-\",L$1),База!$A:$G,6,0))","v":"01:45:49.270"},6,{"$f":"IF(ISERROR(VLOOKUP(CONCATENATE($B18,\"-\",O$1),База!$A:$G,5,0)),IF(ISERROR(VLOOKUP(CONCATENATE($B18,\"-\",O$1),'База выдачи'!$A:$F,5,0)),\"\",VLOOKUP(CONCATENATE($B18,\"-\",O$1),'База выдачи'!$A:$F,5,0)),VLOOKUP(CONCATENATE($B18,\"-\",O$1),База!$A:$G,5,0))","v":"OK"},{"$f":"IF(ISERROR(VLOOKUP(CONCATENATE($B18,\"-\",O$1),База!$A:$G,6,0)),IF(ISERROR(VLOOKUP(CONCATENATE($B18,\"-\",O$1),'База выдачи'!$A:$F,6,0)),\"\",VLOOKUP(CONCATENATE($B18,\"-\",O$1),'База выдачи'!$A:$F,6,0)),VLOOKUP(CONCATENATE($B18,\"-\",O$1),База!$A:$G,6,0))","v":"02:45:36.740"},8,{"$f":"IF(ISERROR(VLOOKUP(CONCATENATE($B18,\"-\",R$1),База!$A:$G,5,0)),IF(ISERROR(VLOOKUP(CONCATENATE($B18,\"-\",R$1),'База выдачи'!$A:$F,5,0)),\"\",VLOOKUP(CONCATENATE($B18,\"-\",R$1),'База выдачи'!$A:$F,5,0)),VLOOKUP(CONCATENATE($B18,\"-\",R$1),База!$A:$G,5,0))","v":"OK"},{"$f":"IF(ISERROR(VLOOKUP(CONCATENATE($B18,\"-\",R$1),База!$A:$G,6,0)),IF(ISERROR(VLOOKUP(CONCATENATE($B18,\"-\",R$1),'База выдачи'!$A:$F,6,0)),\"\",VLOOKUP(CONCATENATE($B18,\"-\",R$1),'База выдачи'!$A:$F,6,0)),VLOOKUP(CONCATENATE($B18,\"-\",R$1),База!$A:$G,6,0))","v":"03:01:05.370"},2,{"$f":"IF(ISERROR(VLOOKUP(CONCATENATE($B18,\"-\",U$1),База!$A:$G,5,0)),IF(ISERROR(VLOOKUP(CONCATENATE($B18,\"-\",U$1),'База выдачи'!$A:$F,5,0)),\"\",VLOOKUP(CONCATENATE($B18,\"-\",U$1),'База выдачи'!$A:$F,5,0)),VLOOKUP(CONCATENATE($B18,\"-\",U$1),База!$A:$G,5,0))","v":"ST"},{"$f":"IF(ISERROR(VLOOKUP(CONCATENATE($B18,\"-\",U$1),База!$A:$G,6,0)),IF(ISERROR(VLOOKUP(CONCATENATE($B18,\"-\",U$1),'База выдачи'!$A:$F,6,0)),\"\",VLOOKUP(CONCATENATE($B18,\"-\",U$1),'База выдачи'!$A:$F,6,0)),VLOOKUP(CONCATENATE($B18,\"-\",U$1),База!$A:$G,6,0))","v":"03:01:07.290"},5,{"$f":"IF(ISERROR(VLOOKUP(CONCATENATE($B18,\"-\",X$1),База!$A:$G,5,0)),IF(ISERROR(VLOOKUP(CONCATENATE($B18,\"-\",X$1),'База выдачи'!$A:$F,5,0)),\"\",VLOOKUP(CONCATENATE($B18,\"-\",X$1),'База выдачи'!$A:$F,5,0)),VLOOKUP(CONCATENATE($B18,\"-\",X$1),База!$A:$G,5,0))","v":""},{"$f":"IF(ISERROR(VLOOKUP(CONCATENATE($B18,\"-\",X$1),База!$A:$G,6,0)),IF(ISERROR(VLOOKUP(CONCATENATE($B18,\"-\",X$1),'База выдачи'!$A:$F,6,0)),\"\",VLOOKUP(CONCATENATE($B18,\"-\",X$1),'База выдачи'!$A:$F,6,0)),VLOOKUP(CONCATENATE($B18,\"-\",X$1),База!$A:$G,6,0))","v":""},4,{"$f":"IF(ISERROR(VLOOKUP(CONCATENATE($B18,\"-\",AA$1),База!$A:$G,5,0)),IF(ISERROR(VLOOKUP(CONCATENATE($B18,\"-\",AA$1),'База выдачи'!$A:$F,5,0)),\"\",VLOOKUP(CONCATENATE($B18,\"-\",AA$1),'База выдачи'!$A:$F,5,0)),VLOOKUP(CONCATENATE($B18,\"-\",AA$1),База!$A:$G,5,0))","v":""},{"$f":"IF(ISERROR(VLOOKUP(CONCATENATE($B18,\"-\",AA$1),База!$A:$G,6,0)),IF(ISERROR(VLOOKUP(CONCATENATE($B18,\"-\",AA$1),'База выдачи'!$A:$F,6,0)),\"\",VLOOKUP(CONCATENATE($B18,\"-\",AA$1),'База выдачи'!$A:$F,6,0)),VLOOKUP(CONCATENATE($B18,\"-\",AA$1),База!$A:$G,6,0))","v":""},"J",{"$f":"IF(ISERROR(VLOOKUP(CONCATENATE($B18,\"-\",AD$1),База!$A:$G,5,0)),IF(ISERROR(VLOOKUP(CONCATENATE($B18,\"-\",AD$1),'База выдачи'!$A:$F,5,0)),\"\",VLOOKUP(CONCATENATE($B18,\"-\",AD$1),'База выдачи'!$A:$F,5,0)),VLOOKUP(CONCATENATE($B18,\"-\",AD$1),База!$A:$G,5,0))","v":""},{"$f":"IF(ISERROR(VLOOKUP(CONCATENATE($B18,\"-\",AD$1),База!$A:$G,6,0)),IF(ISERROR(VLOOKUP(CONCATENATE($B18,\"-\",AD$1),'База выдачи'!$A:$F,6,0)),\"\",VLOOKUP(CONCATENATE($B18,\"-\",AD$1),'База выдачи'!$A:$F,6,0)),VLOOKUP(CONCATENATE($B18,\"-\",AD$1),База!$A:$G,6,0))","v":""},"K",{"$f":"IF(ISERROR(VLOOKUP(CONCATENATE($B18,\"-\",AG$1),База!$A:$G,5,0)),IF(ISERROR(VLOOKUP(CONCATENATE($B18,\"-\",AG$1),'База выдачи'!$A:$F,5,0)),\"\",VLOOKUP(CONCATENATE($B18,\"-\",AG$1),'База выдачи'!$A:$F,5,0)),VLOOKUP(CONCATENATE($B18,\"-\",AG$1),База!$A:$G,5,0))","v":""},{"$f":"IF(ISERROR(VLOOKUP(CONCATENATE($B18,\"-\",AG$1),База!$A:$G,6,0)),IF(ISERROR(VLOOKUP(CONCATENATE($B18,\"-\",AG$1),'База выдачи'!$A:$F,6,0)),\"\",VLOOKUP(CONCATENATE($B18,\"-\",AG$1),'База выдачи'!$A:$F,6,0)),VLOOKUP(CONCATENATE($B18,\"-\",AG$1),База!$A:$G,6,0))","v":""},"L",{"$f":"IF(ISERROR(VLOOKUP(CONCATENATE($B18,\"-\",AJ$1),База!$A:$G,5,0)),IF(ISERROR(VLOOKUP(CONCATENATE($B18,\"-\",AJ$1),'База выдачи'!$A:$F,5,0)),\"\",VLOOKUP(CONCATENATE($B18,\"-\",AJ$1),'База выдачи'!$A:$F,5,0)),VLOOKUP(CONCATENATE($B18,\"-\",AJ$1),База!$A:$G,5,0))","v":""},{"$f":"IF(ISERROR(VLOOKUP(CONCATENATE($B18,\"-\",AJ$1),База!$A:$G,6,0)),IF(ISERROR(VLOOKUP(CONCATENATE($B18,\"-\",AJ$1),'База выдачи'!$A:$F,6,0)),\"\",VLOOKUP(CONCATENATE($B18,\"-\",AJ$1),'База выдачи'!$A:$F,6,0)),VLOOKUP(CONCATENATE($B18,\"-\",AJ$1),База!$A:$G,6,0))","v":""},"M",{"$f":"IF(ISERROR(VLOOKUP(CONCATENATE($B18,\"-\",AM$1),База!$A:$G,5,0)),IF(ISERROR(VLOOKUP(CONCATENATE($B18,\"-\",AM$1),'База выдачи'!$A:$F,5,0)),\"\",VLOOKUP(CONCATENATE($B18,\"-\",AM$1),'База выдачи'!$A:$F,5,0)),VLOOKUP(CONCATENATE($B18,\"-\",AM$1),База!$A:$G,5,0))","v":""},{"$f":"IF(ISERROR(VLOOKUP(CONCATENATE($B18,\"-\",AM$1),База!$A:$G,6,0)),IF(ISERROR(VLOOKUP(CONCATENATE($B18,\"-\",AM$1),'База выдачи'!$A:$F,6,0)),\"\",VLOOKUP(CONCATENATE($B18,\"-\",AM$1),'База выдачи'!$A:$F,6,0)),VLOOKUP(CONCATENATE($B18,\"-\",AM$1),База!$A:$G,6,0))","v":""},"N",{"$f":"IF(ISERROR(VLOOKUP(CONCATENATE($B18,\"-\",AP$1),База!$A:$G,5,0)),IF(ISERROR(VLOOKUP(CONCATENATE($B18,\"-\",AP$1),'База выдачи'!$A:$F,5,0)),\"\",VLOOKUP(CONCATENATE($B18,\"-\",AP$1),'База выдачи'!$A:$F,5,0)),VLOOKUP(CONCATENATE($B18,\"-\",AP$1),База!$A:$G,5,0))","v":""},{"$f":"IF(ISERROR(VLOOKUP(CONCATENATE($B18,\"-\",AP$1),База!$A:$G,6,0)),IF(ISERROR(VLOOKUP(CONCATENATE($B18,\"-\",AP$1),'База выдачи'!$A:$F,6,0)),\"\",VLOOKUP(CONCATENATE($B18,\"-\",AP$1),'База выдачи'!$A:$F,6,0)),VLOOKUP(CONCATENATE($B18,\"-\",AP$1),База!$A:$G,6,0))","v":""},"O",{"$f":"IF(ISERROR(VLOOKUP(CONCATENATE($B18,\"-\",AS$1),База!$A:$G,5,0)),IF(ISERROR(VLOOKUP(CONCATENATE($B18,\"-\",AS$1),'База выдачи'!$A:$F,5,0)),\"\",VLOOKUP(CONCATENATE($B18,\"-\",AS$1),'База выдачи'!$A:$F,5,0)),VLOOKUP(CONCATENATE($B18,\"-\",AS$1),База!$A:$G,5,0))","v":""},{"$f":"IF(ISERROR(VLOOKUP(CONCATENATE($B18,\"-\",AS$1),База!$A:$G,6,0)),IF(ISERROR(VLOOKUP(CONCATENATE($B18,\"-\",AS$1),'База выдачи'!$A:$F,6,0)),\"\",VLOOKUP(CONCATENATE($B18,\"-\",AS$1),'База выдачи'!$A:$F,6,0)),VLOOKUP(CONCATENATE($B18,\"-\",AS$1),База!$A:$G,6,0))","v":""},null,null,{"$f":"COUNTIFS(База!B:B,Статистика!B18,База!E:E,\"OK\")","v":5},{"$f":"$CK$3","v":"03:01:05.370"},10865,{"$f":"COUNTIFS(База!B:B,Статистика!B18,База!E:E,\"XXXX\")","v":1},{"$f":"IF(AX18+AZ18+BA18=0,ксекундвигре-BD18,ксекундвигре*Статистика!AX18+(ксекундвигре-Статистика!AZ18)+Статистика!BA18)","v":54296},54753,16,24]
[17,{"$f":"IF(ISERROR(VLOOKUP(A19,Служебный!B:C,2,0)),\"\",A19&\"-\"&VLOOKUP(A19,Служебный!B:C,2,0))","v":"17-ЭросоМания"},8,{"$f":"IF(ISERROR(VLOOKUP(CONCATENATE($B19,\"-\",C$1),База!$A:$G,5,0)),IF(ISERROR(VLOOKUP(CONCATENATE($B19,\"-\",C$1),'База выдачи'!$A:$F,5,0)),\"\",VLOOKUP(CONCATENATE($B19,\"-\",C$1),'База выдачи'!$A:$F,5,0)),VLOOKUP(CONCATENATE($B19,\"-\",C$1),База!$A:$G,5,0))","v":"OK"},{"$f":"IF(ISERROR(VLOOKUP(CONCATENATE($B19,\"-\",C$1),База!$A:$G,6,0)),IF(ISERROR(VLOOKUP(CONCATENATE($B19,\"-\",C$1),'База выдачи'!$A:$F,6,0)),\"\",VLOOKUP(CONCATENATE($B19,\"-\",C$1),'База выдачи'!$A:$F,6,0)),VLOOKUP(CONCATENATE($B19,\"-\",C$1),База!$A:$G,6,0))","v":"00:32:04.120"},6,{"$f":"IF(ISERROR(VLOOKUP(CONCATENATE($B19,\"-\",F$1),База!$A:$G,5,0)),IF(ISERROR(VLOOKUP(CONCATENATE($B19,\"-\",F$1),'База выдачи'!$A:$F,5,0)),\"\",VLOOKUP(CONCATENATE($B19,\"-\",F$1),'База выдачи'!$A:$F,5,0)),VLOOKUP(CONCATENATE($B19,\"-\",F$1),База!$A:$G,5,0))","v":"XXXX"},{"$f":"IF(ISERROR(VLOOKUP(CONCATENATE($B19,\"-\",F$1),База!$A:$G,6,0)),IF(ISERROR(VLOOKUP(CONCATENATE($B19,\"-\",F$1),'База выдачи'!$A:$F,6,0)),\"\",VLOOKUP(CONCATENATE($B19,\"-\",F$1),'База выдачи'!$A:$F,6,0)),VLOOKUP(CONCATENATE($B19,\"-\",F$1),База!$A:$G,6,0))","v":"01:04:26.760"},2,{"$f":"IF(ISERROR(VLOOKUP(CONCATENATE($B19,\"-\",I$1),База!$A:$G,5,0)),IF(ISERROR(VLOOKUP(CONCATENATE($B19,\"-\",I$1),'База выдачи'!$A:$F,5,0)),\"\",VLOOKUP(CONCATENATE($B19,\"-\",I$1),'База выдачи'!$A:$F,5,0)),VLOOKUP(CONCATENATE($B19,\"-\",I$1),База!$A:$G,5,0))","v":"OK"},{"$f":"IF(ISERROR(VLOOKUP(CONCATENATE($B19,\"-\",I$1),База!$A:$G,6,0)),IF(ISERROR(VLOOKUP(CONCATENATE($B19,\"-\",I$1),'База выдачи'!$A:$F,6,0)),\"\",VLOOKUP(CONCATENATE($B19,\"-\",I$1),'База выдачи'!$A:$F,6,0)),VLOOKUP(CONCATENATE($B19,\"-\",I$1),База!$A:$G,6,0))","v":"01:30:27.130"},9,{"$f":"IF(ISERROR(VLOOKUP(CONCATENATE($B19,\"-\",L$1),База!$A:$G,5,0)),IF(ISERROR(VLOOKUP(CONCATENATE($B19,\"-\",L$1),'База выдачи'!$A:$F,5,0)),\"\",VLOOKUP(CONCATENATE($B19,\"-\",L$1),'База выдачи'!$A:$F,5,0)),VLOOKUP(CONCATENATE($B19,\"-\",L$1),База!$A:$G,5,0))","v":"OK"},{"$f":"IF(ISERROR(VLOOKUP(CONCATENATE($B19,\"-\",L$1),База!$A:$G,6,0)),IF(ISERROR(VLOOKUP(CONCATENATE($B19,\"-\",L$1),'База выдачи'!$A:$F,6,0)),\"\",VLOOKUP(CONCATENATE($B19,\"-\",L$1),'База выдачи'!$A:$F,6,0)),VLOOKUP(CONCATENATE($B19,\"-\",L$1),База!$A:$G,6,0))","v":"01:47:03.600"},7,{"$f":"IF(ISERROR(VLOOKUP(CONCATENATE($B19,\"-\",O$1),База!$A:$G,5,0)),IF(ISERROR(VLOOKUP(CONCATENATE($B19,\"-\",O$1),'База выдачи'!$A:$F,5,0)),\"\",VLOOKUP(CONCATENATE($B19,\"-\",O$1),'База выдачи'!$A:$F,5,0)),VLOOKUP(CONCATENATE($B19,\"-\",O$1),База!$A:$G,5,0))","v":"OK"},{"$f":"IF(ISERROR(VLOOKUP(CONCATENATE($B19,\"-\",O$1),База!$A:$G,6,0)),IF(ISERROR(VLOOKUP(CONCATENATE($B19,\"-\",O$1),'База выдачи'!$A:$F,6,0)),\"\",VLOOKUP(CONCATENATE($B19,\"-\",O$1),'База выдачи'!$A:$F,6,0)),VLOOKUP(CONCATENATE($B19,\"-\",O$1),База!$A:$G,6,0))","v":"02:02:10.440"},4,{"$f":"IF(ISERROR(VLOOKUP(CONCATENATE($B19,\"-\",R$1),База!$A:$G,5,0)),IF(ISERROR(VLOOKUP(CONCATENATE($B19,\"-\",R$1),'База выдачи'!$A:$F,5,0)),\"\",VLOOKUP(CONCATENATE($B19,\"-\",R$1),'База выдачи'!$A:$F,5,0)),VLOOKUP(CONCATENATE($B19,\"-\",R$1),База!$A:$G,5,0))","v":"OK"},{"$f":"IF(ISERROR(VLOOKUP(CONCATENATE($B19,\"-\",R$1),База!$A:$G,6,0)),IF(ISERROR(VLOOKUP(CONCATENATE($B19,\"-\",R$1),'База выдачи'!$A:$F,6,0)),\"\",VLOOKUP(CONCATENATE($B19,\"-\",R$1),'База выдачи'!$A:$F,6,0)),VLOOKUP(CONCATENATE($B19,\"-\",R$1),База!$A:$G,6,0))","v":"02:20:21.240"},3,{"$f":"IF(ISERROR(VLOOKUP(CONCATENATE($B19,\"-\",U$1),База!$A:$G,5,0)),IF(ISERROR(VLOOKUP(CONCATENATE($B19,\"-\",U$1),'База выдачи'!$A:$F,5,0)),\"\",VLOOKUP(CONCATENATE($B19,\"-\",U$1),'База выдачи'!$A:$F,5,0)),VLOOKUP(CONCATENATE($B19,\"-\",U$1),База!$A:$G,5,0))","v":"OK"},{"$f":"IF(ISERROR(VLOOKUP(CONCATENATE($B19,\"-\",U$1),База!$A:$G,6,0)),IF(ISERROR(VLOOKUP(CONCATENATE($B19,\"-\",U$1),'База выдачи'!$A:$F,6,0)),\"\",VLOOKUP(CONCATENATE($B19,\"-\",U$1),'База выдачи'!$A:$F,6,0)),VLOOKUP(CONCATENATE($B19,\"-\",U$1),База!$A:$G,6,0))","v":"02:37:18.410"},1,{"$f":"IF(ISERROR(VLOOKUP(CONCATENATE($B19,\"-\",X$1),База!$A:$G,5,0)),IF(ISERROR(VLOOKUP(CONCATENATE($B19,\"-\",X$1),'База выдачи'!$A:$F,5,0)),\"\",VLOOKUP(CONCATENATE($B19,\"-\",X$1),'База выдачи'!$A:$F,5,0)),VLOOKUP(CONCATENATE($B19,\"-\",X$1),База!$A:$G,5,0))","v":"ST"},{"$f":"IF(ISERROR(VLOOKUP(CONCATENATE($B19,\"-\",X$1),База!$A:$G,6,0)),IF(ISERROR(VLOOKUP(CONCATENATE($B19,\"-\",X$1),'База выдачи'!$A:$F,6,0)),\"\",VLOOKUP(CONCATENATE($B19,\"-\",X$1),'База выдачи'!$A:$F,6,0)),VLOOKUP(CONCATENATE($B19,\"-\",X$1),База!$A:$G,6,0))","v":"02:37:20.310"},5,{"$f":"IF(ISERROR(VLOOKUP(CONCATENATE($B19,\"-\",AA$1),База!$A:$G,5,0)),IF(ISERROR(VLOOKUP(CONCATENATE($B19,\"-\",AA$1),'База выдачи'!$A:$F,5,0)),\"\",VLOOKUP(CONCATENATE($B19,\"-\",AA$1),'База выдачи'!$A:$F,5,0)),VLOOKUP(CONCATENATE($B19,\"-\",AA$1),База!$A:$G,5,0))","v":""},{"$f":"IF(ISERROR(VLOOKUP(CONCATENATE($B19,\"-\",AA$1),База!$A:$G,6,0)),IF(ISERROR(VLOOKUP(CONCATENATE($B19,\"-\",AA$1),'База выдачи'!$A:$F,6,0)),\"\",VLOOKUP(CONCATENATE($B19,\"-\",AA$1),'База выдачи'!$A:$F,6,0)),VLOOKUP(CONCATENATE($B19,\"-\",AA$1),База!$A:$G,6,0))","v":""},"I",{"$f":"IF(ISERROR(VLOOKUP(CONCATENATE($B19,\"-\",AD$1),База!$A:$G,5,0)),IF(ISERROR(VLOOKUP(CONCATENATE($B19,\"-\",AD$1),'База выдачи'!$A:$F,5,0)),\"\",VLOOKUP(CONCATENATE($B19,\"-\",AD$1),'База выдачи'!$A:$F,5,0)),VLOOKUP(CONCATENATE($B19,\"-\",AD$1),База!$A:$G,5,0))","v":""},{"$f":"IF(ISERROR(VLOOKUP(CONCATENATE($B19,\"-\",AD$1),База!$A:$G,6,0)),IF(ISERROR(VLOOKUP(CONCATENATE($B19,\"-\",AD$1),'База выдачи'!$A:$F,6,0)),\"\",VLOOKUP(CONCATENATE($B19,\"-\",AD$1),'База выдачи'!$A:$F,6,0)),VLOOKUP(CONCATENATE($B19,\"-\",AD$1),База!$A:$G,6,0))","v":""},"J",{"$f":"IF(ISERROR(VLOOKUP(CONCATENATE($B19,\"-\",AG$1),База!$A:$G,5,0)),IF(ISERROR(VLOOKUP(CONCATENATE($B19,\"-\",AG$1),'База выдачи'!$A:$F,5,0)),\"\",VLOOKUP(CONCATENATE($B19,\"-\",AG$1),'База выдачи'!$A:$F,5,0)),VLOOKUP(CONCATENATE($B19,\"-\",AG$1),База!$A:$G,5,0))","v":""},{"$f":"IF(ISERROR(VLOOKUP(CONCATENATE($B19,\"-\",AG$1),База!$A:$G,6,0)),IF(ISERROR(VLOOKUP(CONCATENATE($B19,\"-\",AG$1),'База выдачи'!$A:$F,6,0)),\"\",VLOOKUP(CONCATENATE($B19,\"-\",AG$1),'База выдачи'!$A:$F,6,0)),VLOOKUP(CONCATENATE($B19,\"-\",AG$1),База!$A:$G,6,0))","v":""},"K",{"$f":"IF(ISERROR(VLOOKUP(CONCATENATE($B19,\"-\",AJ$1),База!$A:$G,5,0)),IF(ISERROR(VLOOKUP(CONCATENATE($B19,\"-\",AJ$1),'База выдачи'!$A:$F,5,0)),\"\",VLOOKUP(CONCATENATE($B19,\"-\",AJ$1),'База выдачи'!$A:$F,5,0)),VLOOKUP(CONCATENATE($B19,\"-\",AJ$1),База!$A:$G,5,0))","v":""},{"$f":"IF(ISERROR(VLOOKUP(CONCATENATE($B19,\"-\",AJ$1),База!$A:$G,6,0)),IF(ISERROR(VLOOKUP(CONCATENATE($B19,\"-\",AJ$1),'База выдачи'!$A:$F,6,0)),\"\",VLOOKUP(CONCATENATE($B19,\"-\",AJ$1),'База выдачи'!$A:$F,6,0)),VLOOKUP(CONCATENATE($B19,\"-\",AJ$1),База!$A:$G,6,0))","v":""},"L",{"$f":"IF(ISERROR(VLOOKUP(CONCATENATE($B19,\"-\",AM$1),База!$A:$G,5,0)),IF(ISERROR(VLOOKUP(CONCATENATE($B19,\"-\",AM$1),'База выдачи'!$A:$F,5,0)),\"\",VLOOKUP(CONCATENATE($B19,\"-\",AM$1),'База выдачи'!$A:$F,5,0)),VLOOKUP(CONCATENATE($B19,\"-\",AM$1),База!$A:$G,5,0))","v":""},{"$f":"IF(ISERROR(VLOOKUP(CONCATENATE($B19,\"-\",AM$1),База!$A:$G,6,0)),IF(ISERROR(VLOOKUP(CONCATENATE($B19,\"-\",AM$1),'База выдачи'!$A:$F,6,0)),\"\",VLOOKUP(CONCATENATE($B19,\"-\",AM$1),'База выдачи'!$A:$F,6,0)),VLOOKUP(CONCATENATE($B19,\"-\",AM$1),База!$A:$G,6,0))","v":""},"M",{"$f":"IF(ISERROR(VLOOKUP(CONCATENATE($B19,\"-\",AP$1),База!$A:$G,5,0)),IF(ISERROR(VLOOKUP(CONCATENATE($B19,\"-\",AP$1),'База выдачи'!$A:$F,5,0)),\"\",VLOOKUP(CONCATENATE($B19,\"-\",AP$1),'База выдачи'!$A:$F,5,0)),VLOOKUP(CONCATENATE($B19,\"-\",AP$1),База!$A:$G,5,0))","v":""},{"$f":"IF(ISERROR(VLOOKUP(CONCATENATE($B19,\"-\",AP$1),База!$A:$G,6,0)),IF(ISERROR(VLOOKUP(CONCATENATE($B19,\"-\",AP$1),'База выдачи'!$A:$F,6,0)),\"\",VLOOKUP(CONCATENATE($B19,\"-\",AP$1),'База выдачи'!$A:$F,6,0)),VLOOKUP(CONCATENATE($B19,\"-\",AP$1),База!$A:$G,6,0))","v":""},"N",{"$f":"IF(ISERROR(VLOOKUP(CONCATENATE($B19,\"-\",AS$1),База!$A:$G,5,0)),IF(ISERROR(VLOOKUP(CONCATENATE($B19,\"-\",AS$1),'База выдачи'!$A:$F,5,0)),\"\",VLOOKUP(CONCATENATE($B19,\"-\",AS$1),'База выдачи'!$A:$F,5,0)),VLOOKUP(CONCATENATE($B19,\"-\",AS$1),База!$A:$G,5,0))","v":""},{"$f":"IF(ISERROR(VLOOKUP(CONCATENATE($B19,\"-\",AS$1),База!$A:$G,6,0)),IF(ISERROR(VLOOKUP(CONCATENATE($B19,\"-\",AS$1),'База выдачи'!$A:$F,6,0)),\"\",VLOOKUP(CONCATENATE($B19,\"-\",AS$1),'База выдачи'!$A:$F,6,0)),VLOOKUP(CONCATENATE($B19,\"-\",AS$1),База!$A:$G,6,0))","v":""},null,null,{"$f":"COUNTIFS(База!B:B,Статистика!B19,База!E:E,\"OK\")","v":6},{"$f":"CM3","v":"02:37:18.410"},9438,{"$f":"COUNTIFS(База!B:B,Статистика!B19,База!E:E,\"XXXX\")","v":1},{"$f":"IF(AX19+AZ19+BA19=0,ксекундвигре-BD19,ксекундвигре*Статистика!AX19+(ксекундвигре-Статистика!AZ19)+Статистика!BA19)","v":66583},54314,17,19]
[18,{"$f":"IF(ISERROR(VLOOKUP(A20,Служебный!B:C,2,0)),\"\",A20&\"-\"&VLOOKUP(A20,Служебный!B:C,2,0))","v":"18-Юнги"},9,{"$f":"IF(ISERROR(VLOOKUP(CONCATENATE($B20,\"-\",C$1),База!$A:$G,5,0)),IF(ISERROR(VLOOKUP(CONCATENATE($B20,\"-\",C$1),'База выдачи'!$A:$F,5,0)),\"\",VLOOKUP(CONCATENATE($B20,\"-\",C$1),'База выдачи'!$A:$F,5,0)),VLOOKUP(CONCATENATE($B20,\"-\",C$1),База!$A:$G,5,0))","v":"OK"},{"$f":"IF(ISERROR(VLOOKUP(CONCATENATE($B20,\"-\",C$1),База!$A:$G,6,0)),IF(ISERROR(VLOOKUP(CONCATENATE($B20,\"-\",C$1),'База выдачи'!$A:$F,6,0)),\"\",VLOOKUP(CONCATENATE($B20,\"-\",C$1),'База выдачи'!$A:$F,6,0)),VLOOKUP(CONCATENATE($B20,\"-\",C$1),База!$A:$G,6,0))","v":"00:24:13.320"},2,{"$f":"IF(ISERROR(VLOOKUP(CONCATENATE($B20,\"-\",F$1),База!$A:$G,5,0)),IF(ISERROR(VLOOKUP(CONCATENATE($B20,\"-\",F$1),'База выдачи'!$A:$F,5,0)),\"\",VLOOKUP(CONCATENATE($B20,\"-\",F$1),'База выдачи'!$A:$F,5,0)),VLOOKUP(CONCATENATE($B20,\"-\",F$1),База!$A:$G,5,0))","v":"OK"},{"$f":"IF(ISERROR(VLOOKUP(CONCATENATE($B20,\"-\",F$1),База!$A:$G,6,0)),IF(ISERROR(VLOOKUP(CONCATENATE($B20,\"-\",F$1),'База выдачи'!$A:$F,6,0)),\"\",VLOOKUP(CONCATENATE($B20,\"-\",F$1),'База выдачи'!$A:$F,6,0)),VLOOKUP(CONCATENATE($B20,\"-\",F$1),База!$A:$G,6,0))","v":"00:59:49.640"},7,{"$f":"IF(ISERROR(VLOOKUP(CONCATENATE($B20,\"-\",I$1),База!$A:$G,5,0)),IF(ISERROR(VLOOKUP(CONCATENATE($B20,\"-\",I$1),'База выдачи'!$A:$F,5,0)),\"\",VLOOKUP(CONCATENATE($B20,\"-\",I$1),'База выдачи'!$A:$F,5,0)),VLOOKUP(CONCATENATE($B20,\"-\",I$1),База!$A:$G,5,0))","v":"OK"},{"$f":"IF(ISERROR(VLOOKUP(CONCATENATE($B20,\"-\",I$1),База!$A:$G,6,0)),IF(ISERROR(VLOOKUP(CONCATENATE($B20,\"-\",I$1),'База выдачи'!$A:$F,6,0)),\"\",VLOOKUP(CONCATENATE($B20,\"-\",I$1),'База выдачи'!$A:$F,6,0)),VLOOKUP(CONCATENATE($B20,\"-\",I$1),База!$A:$G,6,0))","v":"01:19:54.650"},3,{"$f":"IF(ISERROR(VLOOKUP(CONCATENATE($B20,\"-\",L$1),База!$A:$G,5,0)),IF(ISERROR(VLOOKUP(CONCATENATE($B20,\"-\",L$1),'База выдачи'!$A:$F,5,0)),\"\",VLOOKUP(CONCATENATE($B20,\"-\",L$1),'База выдачи'!$A:$F,5,0)),VLOOKUP(CONCATENATE($B20,\"-\",L$1),База!$A:$G,5,0))","v":"OK"},{"$f":"IF(ISERROR(VLOOKUP(CONCATENATE($B20,\"-\",L$1),База!$A:$G,6,0)),IF(ISERROR(VLOOKUP(CONCATENATE($B20,\"-\",L$1),'База выдачи'!$A:$F,6,0)),\"\",VLOOKUP(CONCATENATE($B20,\"-\",L$1),'База выдачи'!$A:$F,6,0)),VLOOKUP(CONCATENATE($B20,\"-\",L$1),База!$A:$G,6,0))","v":"01:37:23.050"},5,{"$f":"IF(ISERROR(VLOOKUP(CONCATENATE($B20,\"-\",O$1),База!$A:$G,5,0)),IF(ISERROR(VLOOKUP(CONCATENATE($B20,\"-\",O$1),'База выдачи'!$A:$F,5,0)),\"\",VLOOKUP(CONCATENATE($B20,\"-\",O$1),'База выдачи'!$A:$F,5,0)),VLOOKUP(CONCATENATE($B20,\"-\",O$1),База!$A:$G,5,0))","v":"OK"},{"$f":"IF(ISERROR(VLOOKUP(CONCATENATE($B20,\"-\",O$1),База!$A:$G,6,0)),IF(ISERROR(VLOOKUP(CONCATENATE($B20,\"-\",O$1),'База выдачи'!$A:$F,6,0)),\"\",VLOOKUP(CONCATENATE($B20,\"-\",O$1),'База выдачи'!$A:$F,6,0)),VLOOKUP(CONCATENATE($B20,\"-\",O$1),База!$A:$G,6,0))","v":"01:49:14.470"},1,{"$f":"IF(ISERROR(VLOOKUP(CONCATENATE($B20,\"-\",R$1),База!$A:$G,5,0)),IF(ISERROR(VLOOKUP(CONCATENATE($B20,\"-\",R$1),'База выдачи'!$A:$F,5,0)),\"\",VLOOKUP(CONCATENATE($B20,\"-\",R$1),'База выдачи'!$A:$F,5,0)),VLOOKUP(CONCATENATE($B20,\"-\",R$1),База!$A:$G,5,0))","v":"OK"},{"$f":"IF(ISERROR(VLOOKUP(CONCATENATE($B20,\"-\",R$1),База!$A:$G,6,0)),IF(ISERROR(VLOOKUP(CONCATENATE($B20,\"-\",R$1),'База выдачи'!$A:$F,6,0)),\"\",VLOOKUP(CONCATENATE($B20,\"-\",R$1),'База выдачи'!$A:$F,6,0)),VLOOKUP(CONCATENATE($B20,\"-\",R$1),База!$A:$G,6,0))","v":"02:40:27.570"},6,{"$f":"IF(ISERROR(VLOOKUP(CONCATENATE($B20,\"-\",U$1),База!$A:$G,5,0)),IF(ISERROR(VLOOKUP(CONCATENATE($B20,\"-\",U$1),'База выдачи'!$A:$F,5,0)),\"\",VLOOKUP(CONCATENATE($B20,\"-\",U$1),'База выдачи'!$A:$F,5,0)),VLOOKUP(CONCATENATE($B20,\"-\",U$1),База!$A:$G,5,0))","v":"ST"},{"$f":"IF(ISERROR(VLOOKUP(CONCATENATE($B20,\"-\",U$1),База!$A:$G,6,0)),IF(ISERROR(VLOOKUP(CONCATENATE($B20,\"-\",U$1),'База выдачи'!$A:$F,6,0)),\"\",VLOOKUP(CONCATENATE($B20,\"-\",U$1),'База выдачи'!$A:$F,6,0)),VLOOKUP(CONCATENATE($B20,\"-\",U$1),База!$A:$G,6,0))","v":"02:40:29.460"},4,{"$f":"IF(ISERROR(VLOOKUP(CONCATENATE($B20,\"-\",X$1),База!$A:$G,5,0)),IF(ISERROR(VLOOKUP(CONCATENATE($B20,\"-\",X$1),'База выдачи'!$A:$F,5,0)),\"\",VLOOKUP(CONCATENATE($B20,\"-\",X$1),'База выдачи'!$A:$F,5,0)),VLOOKUP(CONCATENATE($B20,\"-\",X$1),База!$A:$G,5,0))","v":""},{"$f":"IF(ISERROR(VLOOKUP(CONCATENATE($B20,\"-\",X$1),База!$A:$G,6,0)),IF(ISERROR(VLOOKUP(CONCATENATE($B20,\"-\",X$1),'База выдачи'!$A:$F,6,0)),\"\",VLOOKUP(CONCATENATE($B20,\"-\",X$1),'База выдачи'!$A:$F,6,0)),VLOOKUP(CONCATENATE($B20,\"-\",X$1),База!$A:$G,6,0))","v":""},8,{"$f":"IF(ISERROR(VLOOKUP(CONCATENATE($B20,\"-\",AA$1),База!$A:$G,5,0)),IF(ISERROR(VLOOKUP(CONCATENATE($B20,\"-\",AA$1),'База выдачи'!$A:$F,5,0)),\"\",VLOOKUP(CONCATENATE($B20,\"-\",AA$1),'База выдачи'!$A:$F,5,0)),VLOOKUP(CONCATENATE($B20,\"-\",AA$1),База!$A:$G,5,0))","v":""},{"$f":"IF(ISERROR(VLOOKUP(CONCATENATE($B20,\"-\",AA$1),База!$A:$G,6,0)),IF(ISERROR(VLOOKUP(CONCATENATE($B20,\"-\",AA$1),'База выдачи'!$A:$F,6,0)),\"\",VLOOKUP(CONCATENATE($B20,\"-\",AA$1),'База выдачи'!$A:$F,6,0)),VLOOKUP(CONCATENATE($B20,\"-\",AA$1),База!$A:$G,6,0))","v":""},"H",{"$f":"IF(ISERROR(VLOOKUP(CONCATENATE($B20,\"-\",AD$1),База!$A:$G,5,0)),IF(ISERROR(VLOOKUP(CONCATENATE($B20,\"-\",AD$1),'База выдачи'!$A:$F,5,0)),\"\",VLOOKUP(CONCATENATE($B20,\"-\",AD$1),'База выдачи'!$A:$F,5,0)),VLOOKUP(CONCATENATE($B20,\"-\",AD$1),База!$A:$G,5,0))","v":""},{"$f":"IF(ISERROR(VLOOKUP(CONCATENATE($B20,\"-\",AD$1),База!$A:$G,6,0)),IF(ISERROR(VLOOKUP(CONCATENATE($B20,\"-\",AD$1),'База выдачи'!$A:$F,6,0)),\"\",VLOOKUP(CONCATENATE($B20,\"-\",AD$1),'База выдачи'!$A:$F,6,0)),VLOOKUP(CONCATENATE($B20,\"-\",AD$1),База!$A:$G,6,0))","v":""},"I",{"$f":"IF(ISERROR(VLOOKUP(CONCATENATE($B20,\"-\",AG$1),База!$A:$G,5,0)),IF(ISERROR(VLOOKUP(CONCATENATE($B20,\"-\",AG$1),'База выдачи'!$A:$F,5,0)),\"\",VLOOKUP(CONCATENATE($B20,\"-\",AG$1),'База выдачи'!$A:$F,5,0)),VLOOKUP(CONCATENATE($B20,\"-\",AG$1),База!$A:$G,5,0))","v":""},{"$f":"IF(ISERROR(VLOOKUP(CONCATENATE($B20,\"-\",AG$1),База!$A:$G,6,0)),IF(ISERROR(VLOOKUP(CONCATENATE($B20,\"-\",AG$1),'База выдачи'!$A:$F,6,0)),\"\",VLOOKUP(CONCATENATE($B20,\"-\",AG$1),'База выдачи'!$A:$F,6,0)),VLOOKUP(CONCATENATE($B20,\"-\",AG$1),База!$A:$G,6,0))","v":""},"J",{"$f":"IF(ISERROR(VLOOKUP(CONCATENATE($B20,\"-\",AJ$1),База!$A:$G,5,0)),IF(ISERROR(VLOOKUP(CONCATENATE($B20,\"-\",AJ$1),'База выдачи'!$A:$F,5,0)),\"\",VLOOKUP(CONCATENATE($B20,\"-\",AJ$1),'База выдачи'!$A:$F,5,0)),VLOOKUP(CONCATENATE($B20,\"-\",AJ$1),База!$A:$G,5,0))","v":""},{"$f":"IF(ISERROR(VLOOKUP(CONCATENATE($B20,\"-\",AJ$1),База!$A:$G,6,0)),IF(ISERROR(VLOOKUP(CONCATENATE($B20,\"-\",AJ$1),'База выдачи'!$A:$F,6,0)),\"\",VLOOKUP(CONCATENATE($B20,\"-\",AJ$1),'База выдачи'!$A:$F,6,0)),VLOOKUP(CONCATENATE($B20,\"-\",AJ$1),База!$A:$G,6,0))","v":""},"K",{"$f":"IF(ISERROR(VLOOKUP(CONCATENATE($B20,\"-\",AM$1),База!$A:$G,5,0)),IF(ISERROR(VLOOKUP(CONCATENATE($B20,\"-\",AM$1),'База выдачи'!$A:$F,5,0)),\"\",VLOOKUP(CONCATENATE($B20,\"-\",AM$1),'База выдачи'!$A:$F,5,0)),VLOOKUP(CONCATENATE($B20,\"-\",AM$1),База!$A:$G,5,0))","v":""},{"$f":"IF(ISERROR(VLOOKUP(CONCATENATE($B20,\"-\",AM$1),База!$A:$G,6,0)),IF(ISERROR(VLOOKUP(CONCATENATE($B20,\"-\",AM$1),'База выдачи'!$A:$F,6,0)),\"\",VLOOKUP(CONCATENATE($B20,\"-\",AM$1),'База выдачи'!$A:$F,6,0)),VLOOKUP(CONCATENATE($B20,\"-\",AM$1),База!$A:$G,6,0))","v":""},"L",{"$f":"IF(ISERROR(VLOOKUP(CONCATENATE($B20,\"-\",AP$1),База!$A:$G,5,0)),IF(ISERROR(VLOOKUP(CONCATENATE($B20,\"-\",AP$1),'База выдачи'!$A:$F,5,0)),\"\",VLOOKUP(CONCATENATE($B20,\"-\",AP$1),'База выдачи'!$A:$F,5,0)),VLOOKUP(CONCATENATE($B20,\"-\",AP$1),База!$A:$G,5,0))","v":""},{"$f":"IF(ISERROR(VLOOKUP(CONCATENATE($B20,\"-\",AP$1),База!$A:$G,6,0)),IF(ISERROR(VLOOKUP(CONCATENATE($B20,\"-\",AP$1),'База выдачи'!$A:$F,6,0)),\"\",VLOOKUP(CONCATENATE($B20,\"-\",AP$1),'База выдачи'!$A:$F,6,0)),VLOOKUP(CONCATENATE($B20,\"-\",AP$1),База!$A:$G,6,0))","v":""},"M",{"$f":"IF(ISERROR(VLOOKUP(CONCATENATE($B20,\"-\",AS$1),База!$A:$G,5,0)),IF(ISERROR(VLOOKUP(CONCATENATE($B20,\"-\",AS$1),'База выдачи'!$A:$F,5,0)),\"\",VLOOKUP(CONCATENATE($B20,\"-\",AS$1),'База выдачи'!$A:$F,5,0)),VLOOKUP(CONCATENATE($B20,\"-\",AS$1),База!$A:$G,5,0))","v":""},{"$f":"IF(ISERROR(VLOOKUP(CONCATENATE($B20,\"-\",AS$1),База!$A:$G,6,0)),IF(ISERROR(VLOOKUP(CONCATENATE($B20,\"-\",AS$1),'База выдачи'!$A:$F,6,0)),\"\",VLOOKUP(CONCATENATE($B20,\"-\",AS$1),'База выдачи'!$A:$F,6,0)),VLOOKUP(CONCATENATE($B20,\"-\",AS$1),База!$A:$G,6,0))","v":""},null,null,{"$f":"COUNTIFS(База!B:B,Статистика!B20,База!E:E,\"OK\")","v":6},{"$f":"CO3","v":"02:40:27.570"},9628,{"$f":"COUNTIFS(База!B:B,Статистика!B20,База!E:E,\"XXXX\")","v":0},{"$f":"IF(AX20+AZ20+BA20=0,ксекундвигре-BD20,ксекундвигре*Статистика!AX20+(ксекундвигре-Статистика!AZ20)+Статистика!BA20)","v":66392},54296,18,16]
[19,{"$f":"IF(ISERROR(VLOOKUP(A21,Служебный!B:C,2,0)),\"\",A21&\"-\"&VLOOKUP(A21,Служебный!B:C,2,0))","v":"19-Турбо-Зиппер"},1,{"$f":"IF(ISERROR(VLOOKUP(CONCATENATE($B21,\"-\",C$1),База!$A:$G,5,0)),IF(ISERROR(VLOOKUP(CONCATENATE($B21,\"-\",C$1),'База выдачи'!$A:$F,5,0)),\"\",VLOOKUP(CONCATENATE($B21,\"-\",C$1),'База выдачи'!$A:$F,5,0)),VLOOKUP(CONCATENATE($B21,\"-\",C$1),База!$A:$G,5,0))","v":"XXXX"},{"$f":"IF(ISERROR(VLOOKUP(CONCATENATE($B21,\"-\",C$1),База!$A:$G,6,0)),IF(ISERROR(VLOOKUP(CONCATENATE($B21,\"-\",C$1),'База выдачи'!$A:$F,6,0)),\"\",VLOOKUP(CONCATENATE($B21,\"-\",C$1),'База выдачи'!$A:$F,6,0)),VLOOKUP(CONCATENATE($B21,\"-\",C$1),База!$A:$G,6,0))","v":"01:10:04.500"},5,{"$f":"IF(ISERROR(VLOOKUP(CONCATENATE($B21,\"-\",F$1),База!$A:$G,5,0)),IF(ISERROR(VLOOKUP(CONCATENATE($B21,\"-\",F$1),'База выдачи'!$A:$F,5,0)),\"\",VLOOKUP(CONCATENATE($B21,\"-\",F$1),'База выдачи'!$A:$F,5,0)),VLOOKUP(CONCATENATE($B21,\"-\",F$1),База!$A:$G,5,0))","v":"OK"},{"$f":"IF(ISERROR(VLOOKUP(CONCATENATE($B21,\"-\",F$1),База!$A:$G,6,0)),IF(ISERROR(VLOOKUP(CONCATENATE($B21,\"-\",F$1),'База выдачи'!$A:$F,6,0)),\"\",VLOOKUP(CONCATENATE($B21,\"-\",F$1),'База выдачи'!$A:$F,6,0)),VLOOKUP(CONCATENATE($B21,\"-\",F$1),База!$A:$G,6,0))","v":"01:48:48.590"},2,{"$f":"IF(ISERROR(VLOOKUP(CONCATENATE($B21,\"-\",I$1),База!$A:$G,5,0)),IF(ISERROR(VLOOKUP(CONCATENATE($B21,\"-\",I$1),'База выдачи'!$A:$F,5,0)),\"\",VLOOKUP(CONCATENATE($B21,\"-\",I$1),'База выдачи'!$A:$F,5,0)),VLOOKUP(CONCATENATE($B21,\"-\",I$1),База!$A:$G,5,0))","v":"OK"},{"$f":"IF(ISERROR(VLOOKUP(CONCATENATE($B21,\"-\",I$1),База!$A:$G,6,0)),IF(ISERROR(VLOOKUP(CONCATENATE($B21,\"-\",I$1),'База выдачи'!$A:$F,6,0)),\"\",VLOOKUP(CONCATENATE($B21,\"-\",I$1),'База выдачи'!$A:$F,6,0)),VLOOKUP(CONCATENATE($B21,\"-\",I$1),База!$A:$G,6,0))","v":"02:06:32.660"},9,{"$f":"IF(ISERROR(VLOOKUP(CONCATENATE($B21,\"-\",L$1),База!$A:$G,5,0)),IF(ISERROR(VLOOKUP(CONCATENATE($B21,\"-\",L$1),'База выдачи'!$A:$F,5,0)),\"\",VLOOKUP(CONCATENATE($B21,\"-\",L$1),'База выдачи'!$A:$F,5,0)),VLOOKUP(CONCATENATE($B21,\"-\",L$1),База!$A:$G,5,0))","v":"OK"},{"$f":"IF(ISERROR(VLOOKUP(CONCATENATE($B21,\"-\",L$1),База!$A:$G,6,0)),IF(ISERROR(VLOOKUP(CONCATENATE($B21,\"-\",L$1),'База выдачи'!$A:$F,6,0)),\"\",VLOOKUP(CONCATENATE($B21,\"-\",L$1),'База выдачи'!$A:$F,6,0)),VLOOKUP(CONCATENATE($B21,\"-\",L$1),База!$A:$G,6,0))","v":"02:38:01.390"},8,{"$f":"IF(ISERROR(VLOOKUP(CONCATENATE($B21,\"-\",O$1),База!$A:$G,5,0)),IF(ISERROR(VLOOKUP(CONCATENATE($B21,\"-\",O$1),'База выдачи'!$A:$F,5,0)),\"\",VLOOKUP(CONCATENATE($B21,\"-\",O$1),'База выдачи'!$A:$F,5,0)),VLOOKUP(CONCATENATE($B21,\"-\",O$1),База!$A:$G,5,0))","v":"OK"},{"$f":"IF(ISERROR(VLOOKUP(CONCATENATE($B21,\"-\",O$1),База!$A:$G,6,0)),IF(ISERROR(VLOOKUP(CONCATENATE($B21,\"-\",O$1),'База выдачи'!$A:$F,6,0)),\"\",VLOOKUP(CONCATENATE($B21,\"-\",O$1),'База выдачи'!$A:$F,6,0)),VLOOKUP(CONCATENATE($B21,\"-\",O$1),База!$A:$G,6,0))","v":"02:46:06.580"},3,{"$f":"IF(ISERROR(VLOOKUP(CONCATENATE($B21,\"-\",R$1),База!$A:$G,5,0)),IF(ISERROR(VLOOKUP(CONCATENATE($B21,\"-\",R$1),'База выдачи'!$A:$F,5,0)),\"\",VLOOKUP(CONCATENATE($B21,\"-\",R$1),'База выдачи'!$A:$F,5,0)),VLOOKUP(CONCATENATE($B21,\"-\",R$1),База!$A:$G,5,0))","v":"OK"},{"$f":"IF(ISERROR(VLOOKUP(CONCATENATE($B21,\"-\",R$1),База!$A:$G,6,0)),IF(ISERROR(VLOOKUP(CONCATENATE($B21,\"-\",R$1),'База выдачи'!$A:$F,6,0)),\"\",VLOOKUP(CONCATENATE($B21,\"-\",R$1),'База выдачи'!$A:$F,6,0)),VLOOKUP(CONCATENATE($B21,\"-\",R$1),База!$A:$G,6,0))","v":"03:00:46.620"},4,{"$f":"IF(ISERROR(VLOOKUP(CONCATENATE($B21,\"-\",U$1),База!$A:$G,5,0)),IF(ISERROR(VLOOKUP(CONCATENATE($B21,\"-\",U$1),'База выдачи'!$A:$F,5,0)),\"\",VLOOKUP(CONCATENATE($B21,\"-\",U$1),'База выдачи'!$A:$F,5,0)),VLOOKUP(CONCATENATE($B21,\"-\",U$1),База!$A:$G,5,0))","v":"ST"},{"$f":"IF(ISERROR(VLOOKUP(CONCATENATE($B21,\"-\",U$1),База!$A:$G,6,0)),IF(ISERROR(VLOOKUP(CONCATENATE($B21,\"-\",U$1),'База выдачи'!$A:$F,6,0)),\"\",VLOOKUP(CONCATENATE($B21,\"-\",U$1),'База выдачи'!$A:$F,6,0)),VLOOKUP(CONCATENATE($B21,\"-\",U$1),База!$A:$G,6,0))","v":"03:00:48.540"},6,{"$f":"IF(ISERROR(VLOOKUP(CONCATENATE($B21,\"-\",X$1),База!$A:$G,5,0)),IF(ISERROR(VLOOKUP(CONCATENATE($B21,\"-\",X$1),'База выдачи'!$A:$F,5,0)),\"\",VLOOKUP(CONCATENATE($B21,\"-\",X$1),'База выдачи'!$A:$F,5,0)),VLOOKUP(CONCATENATE($B21,\"-\",X$1),База!$A:$G,5,0))","v":""},{"$f":"IF(ISERROR(VLOOKUP(CONCATENATE($B21,\"-\",X$1),База!$A:$G,6,0)),IF(ISERROR(VLOOKUP(CONCATENATE($B21,\"-\",X$1),'База выдачи'!$A:$F,6,0)),\"\",VLOOKUP(CONCATENATE($B21,\"-\",X$1),'База выдачи'!$A:$F,6,0)),VLOOKUP(CONCATENATE($B21,\"-\",X$1),База!$A:$G,6,0))","v":""},7,{"$f":"IF(ISERROR(VLOOKUP(CONCATENATE($B21,\"-\",AA$1),База!$A:$G,5,0)),IF(ISERROR(VLOOKUP(CONCATENATE($B21,\"-\",AA$1),'База выдачи'!$A:$F,5,0)),\"\",VLOOKUP(CONCATENATE($B21,\"-\",AA$1),'База выдачи'!$A:$F,5,0)),VLOOKUP(CONCATENATE($B21,\"-\",AA$1),База!$A:$G,5,0))","v":""},{"$f":"IF(ISERROR(VLOOKUP(CONCATENATE($B21,\"-\",AA$1),База!$A:$G,6,0)),IF(ISERROR(VLOOKUP(CONCATENATE($B21,\"-\",AA$1),'База выдачи'!$A:$F,6,0)),\"\",VLOOKUP(CONCATENATE($B21,\"-\",AA$1),'База выдачи'!$A:$F,6,0)),VLOOKUP(CONCATENATE($B21,\"-\",AA$1),База!$A:$G,6,0))","v":""},"G",{"$f":"IF(ISERROR(VLOOKUP(CONCATENATE($B21,\"-\",AD$1),База!$A:$G,5,0)),IF(ISERROR(VLOOKUP(CONCATENATE($B21,\"-\",AD$1),'База выдачи'!$A:$F,5,0)),\"\",VLOOKUP(CONCATENATE($B21,\"-\",AD$1),'База выдачи'!$A:$F,5,0)),VLOOKUP(CONCATENATE($B21,\"-\",AD$1),База!$A:$G,5,0))","v":""},{"$f":"IF(ISERROR(VLOOKUP(CONCATENATE($B21,\"-\",AD$1),База!$A:$G,6,0)),IF(ISERROR(VLOOKUP(CONCATENATE($B21,\"-\",AD$1),'База выдачи'!$A:$F,6,0)),\"\",VLOOKUP(CONCATENATE($B21,\"-\",AD$1),'База выдачи'!$A:$F,6,0)),VLOOKUP(CONCATENATE($B21,\"-\",AD$1),База!$A:$G,6,0))","v":""},"H",{"$f":"IF(ISERROR(VLOOKUP(CONCATENATE($B21,\"-\",AG$1),База!$A:$G,5,0)),IF(ISERROR(VLOOKUP(CONCATENATE($B21,\"-\",AG$1),'База выдачи'!$A:$F,5,0)),\"\",VLOOKUP(CONCATENATE($B21,\"-\",AG$1),'База выдачи'!$A:$F,5,0)),VLOOKUP(CONCATENATE($B21,\"-\",AG$1),База!$A:$G,5,0))","v":""},{"$f":"IF(ISERROR(VLOOKUP(CONCATENATE($B21,\"-\",AG$1),База!$A:$G,6,0)),IF(ISERROR(VLOOKUP(CONCATENATE($B21,\"-\",AG$1),'База выдачи'!$A:$F,6,0)),\"\",VLOOKUP(CONCATENATE($B21,\"-\",AG$1),'База выдачи'!$A:$F,6,0)),VLOOKUP(CONCATENATE($B21,\"-\",AG$1),База!$A:$G,6,0))","v":""},"I",{"$f":"IF(ISERROR(VLOOKUP(CONCATENATE($B21,\"-\",AJ$1),База!$A:$G,5,0)),IF(ISERROR(VLOOKUP(CONCATENATE($B21,\"-\",AJ$1),'База выдачи'!$A:$F,5,0)),\"\",VLOOKUP(CONCATENATE($B21,\"-\",AJ$1),'База выдачи'!$A:$F,5,0)),VLOOKUP(CONCATENATE($B21,\"-\",AJ$1),База!$A:$G,5,0))","v":""},{"$f":"IF(ISERROR(VLOOKUP(CONCATENATE($B21,\"-\",AJ$1),База!$A:$G,6,0)),IF(ISERROR(VLOOKUP(CONCATENATE($B21,\"-\",AJ$1),'База выдачи'!$A:$F,6,0)),\"\",VLOOKUP(CONCATENATE($B21,\"-\",AJ$1),'База выдачи'!$A:$F,6,0)),VLOOKUP(CONCATENATE($B21,\"-\",AJ$1),База!$A:$G,6,0))","v":""},"J",{"$f":"IF(ISERROR(VLOOKUP(CONCATENATE($B21,\"-\",AM$1),База!$A:$G,5,0)),IF(ISERROR(VLOOKUP(CONCATENATE($B21,\"-\",AM$1),'База выдачи'!$A:$F,5,0)),\"\",VLOOKUP(CONCATENATE($B21,\"-\",AM$1),'База выдачи'!$A:$F,5,0)),VLOOKUP(CONCATENATE($B21,\"-\",AM$1),База!$A:$G,5,0))","v":""},{"$f":"IF(ISERROR(VLOOKUP(CONCATENATE($B21,\"-\",AM$1),База!$A:$G,6,0)),IF(ISERROR(VLOOKUP(CONCATENATE($B21,\"-\",AM$1),'База выдачи'!$A:$F,6,0)),\"\",VLOOKUP(CONCATENATE($B21,\"-\",AM$1),'База выдачи'!$A:$F,6,0)),VLOOKUP(CONCATENATE($B21,\"-\",AM$1),База!$A:$G,6,0))","v":""},"K",{"$f":"IF(ISERROR(VLOOKUP(CONCATENATE($B21,\"-\",AP$1),База!$A:$G,5,0)),IF(ISERROR(VLOOKUP(CONCATENATE($B21,\"-\",AP$1),'База выдачи'!$A:$F,5,0)),\"\",VLOOKUP(CONCATENATE($B21,\"-\",AP$1),'База выдачи'!$A:$F,5,0)),VLOOKUP(CONCATENATE($B21,\"-\",AP$1),База!$A:$G,5,0))","v":""},{"$f":"IF(ISERROR(VLOOKUP(CONCATENATE($B21,\"-\",AP$1),База!$A:$G,6,0)),IF(ISERROR(VLOOKUP(CONCATENATE($B21,\"-\",AP$1),'База выдачи'!$A:$F,6,0)),\"\",VLOOKUP(CONCATENATE($B21,\"-\",AP$1),'База выдачи'!$A:$F,6,0)),VLOOKUP(CONCATENATE($B21,\"-\",AP$1),База!$A:$G,6,0))","v":""},"L",{"$f":"IF(ISERROR(VLOOKUP(CONCATENATE($B21,\"-\",AS$1),База!$A:$G,5,0)),IF(ISERROR(VLOOKUP(CONCATENATE($B21,\"-\",AS$1),'База выдачи'!$A:$F,5,0)),\"\",VLOOKUP(CONCATENATE($B21,\"-\",AS$1),'База выдачи'!$A:$F,5,0)),VLOOKUP(CONCATENATE($B21,\"-\",AS$1),База!$A:$G,5,0))","v":""},{"$f":"IF(ISERROR(VLOOKUP(CONCATENATE($B21,\"-\",AS$1),База!$A:$G,6,0)),IF(ISERROR(VLOOKUP(CONCATENATE($B21,\"-\",AS$1),'База выдачи'!$A:$F,6,0)),\"\",VLOOKUP(CONCATENATE($B21,\"-\",AS$1),'База выдачи'!$A:$F,6,0)),VLOOKUP(CONCATENATE($B21,\"-\",AS$1),База!$A:$G,6,0))","v":""},null,null,{"$f":"COUNTIFS(База!B:B,Статистика!B21,База!E:E,\"OK\")","v":5},{"$f":"CQ3","v":"03:00:46.620"},10847,{"$f":"COUNTIFS(База!B:B,Статистика!B21,База!E:E,\"XXXX\")","v":1},{"$f":"IF(AX21+AZ21+BA21=0,ксекундвигре-BD21,ксекундвигре*Статистика!AX21+(ксекундвигре-Статистика!AZ21)+Статистика!BA21)","v":54314},54223,19,6]
[20,{"$f":"IF(ISERROR(VLOOKUP(A22,Служебный!B:C,2,0)),\"\",A22&\"-\"&VLOOKUP(A22,Служебный!B:C,2,0))","v":"20-Дети шпионов"},2,{"$f":"IF(ISERROR(VLOOKUP(CONCATENATE($B22,\"-\",C$1),База!$A:$G,5,0)),IF(ISERROR(VLOOKUP(CONCATENATE($B22,\"-\",C$1),'База выдачи'!$A:$F,5,0)),\"\",VLOOKUP(CONCATENATE($B22,\"-\",C$1),'База выдачи'!$A:$F,5,0)),VLOOKUP(CONCATENATE($B22,\"-\",C$1),База!$A:$G,5,0))","v":"OK"},{"$f":"IF(ISERROR(VLOOKUP(CONCATENATE($B22,\"-\",C$1),База!$A:$G,6,0)),IF(ISERROR(VLOOKUP(CONCATENATE($B22,\"-\",C$1),'База выдачи'!$A:$F,6,0)),\"\",VLOOKUP(CONCATENATE($B22,\"-\",C$1),'База выдачи'!$A:$F,6,0)),VLOOKUP(CONCATENATE($B22,\"-\",C$1),База!$A:$G,6,0))","v":"00:44:09.730"},6,{"$f":"IF(ISERROR(VLOOKUP(CONCATENATE($B22,\"-\",F$1),База!$A:$G,5,0)),IF(ISERROR(VLOOKUP(CONCATENATE($B22,\"-\",F$1),'База выдачи'!$A:$F,5,0)),\"\",VLOOKUP(CONCATENATE($B22,\"-\",F$1),'База выдачи'!$A:$F,5,0)),VLOOKUP(CONCATENATE($B22,\"-\",F$1),База!$A:$G,5,0))","v":"XXXX"},{"$f":"IF(ISERROR(VLOOKUP(CONCATENATE($B22,\"-\",F$1),База!$A:$G,6,0)),IF(ISERROR(VLOOKUP(CONCATENATE($B22,\"-\",F$1),'База выдачи'!$A:$F,6,0)),\"\",VLOOKUP(CONCATENATE($B22,\"-\",F$1),'База выдачи'!$A:$F,6,0)),VLOOKUP(CONCATENATE($B22,\"-\",F$1),База!$A:$G,6,0))","v":"01:30:55.030"},3,{"$f":"IF(ISERROR(VLOOKUP(CONCATENATE($B22,\"-\",I$1),База!$A:$G,5,0)),IF(ISERROR(VLOOKUP(CONCATENATE($B22,\"-\",I$1),'База выдачи'!$A:$F,5,0)),\"\",VLOOKUP(CONCATENATE($B22,\"-\",I$1),'База выдачи'!$A:$F,5,0)),VLOOKUP(CONCATENATE($B22,\"-\",I$1),База!$A:$G,5,0))","v":"OK"},{"$f":"IF(ISERROR(VLOOKUP(CONCATENATE($B22,\"-\",I$1),База!$A:$G,6,0)),IF(ISERROR(VLOOKUP(CONCATENATE($B22,\"-\",I$1),'База выдачи'!$A:$F,6,0)),\"\",VLOOKUP(CONCATENATE($B22,\"-\",I$1),'База выдачи'!$A:$F,6,0)),VLOOKUP(CONCATENATE($B22,\"-\",I$1),База!$A:$G,6,0))","v":"01:43:24.760"},8,{"$f":"IF(ISERROR(VLOOKUP(CONCATENATE($B22,\"-\",L$1),База!$A:$G,5,0)),IF(ISERROR(VLOOKUP(CONCATENATE($B22,\"-\",L$1),'База выдачи'!$A:$F,5,0)),\"\",VLOOKUP(CONCATENATE($B22,\"-\",L$1),'База выдачи'!$A:$F,5,0)),VLOOKUP(CONCATENATE($B22,\"-\",L$1),База!$A:$G,5,0))","v":"OK"},{"$f":"IF(ISERROR(VLOOKUP(CONCATENATE($B22,\"-\",L$1),База!$A:$G,6,0)),IF(ISERROR(VLOOKUP(CONCATENATE($B22,\"-\",L$1),'База выдачи'!$A:$F,6,0)),\"\",VLOOKUP(CONCATENATE($B22,\"-\",L$1),'База выдачи'!$A:$F,6,0)),VLOOKUP(CONCATENATE($B22,\"-\",L$1),База!$A:$G,6,0))","v":"02:09:06.400"},1,{"$f":"IF(ISERROR(VLOOKUP(CONCATENATE($B22,\"-\",O$1),База!$A:$G,5,0)),IF(ISERROR(VLOOKUP(CONCATENATE($B22,\"-\",O$1),'База выдачи'!$A:$F,5,0)),\"\",VLOOKUP(CONCATENATE($B22,\"-\",O$1),'База выдачи'!$A:$F,5,0)),VLOOKUP(CONCATENATE($B22,\"-\",O$1),База!$A:$G,5,0))","v":"OK"},{"$f":"IF(ISERROR(VLOOKUP(CONCATENATE($B22,\"-\",O$1),База!$A:$G,6,0)),IF(ISERROR(VLOOKUP(CONCATENATE($B22,\"-\",O$1),'База выдачи'!$A:$F,6,0)),\"\",VLOOKUP(CONCATENATE($B22,\"-\",O$1),'База выдачи'!$A:$F,6,0)),VLOOKUP(CONCATENATE($B22,\"-\",O$1),База!$A:$G,6,0))","v":"02:39:58.920"},4,{"$f":"IF(ISERROR(VLOOKUP(CONCATENATE($B22,\"-\",R$1),База!$A:$G,5,0)),IF(ISERROR(VLOOKUP(CONCATENATE($B22,\"-\",R$1),'База выдачи'!$A:$F,5,0)),\"\",VLOOKUP(CONCATENATE($B22,\"-\",R$1),'База выдачи'!$A:$F,5,0)),VLOOKUP(CONCATENATE($B22,\"-\",R$1),База!$A:$G,5,0))","v":"ST"},{"$f":"IF(ISERROR(VLOOKUP(CONCATENATE($B22,\"-\",R$1),База!$A:$G,6,0)),IF(ISERROR(VLOOKUP(CONCATENATE($B22,\"-\",R$1),'База выдачи'!$A:$F,6,0)),\"\",VLOOKUP(CONCATENATE($B22,\"-\",R$1),'База выдачи'!$A:$F,6,0)),VLOOKUP(CONCATENATE($B22,\"-\",R$1),База!$A:$G,6,0))","v":"02:40:00.820"},5,{"$f":"IF(ISERROR(VLOOKUP(CONCATENATE($B22,\"-\",U$1),База!$A:$G,5,0)),IF(ISERROR(VLOOKUP(CONCATENATE($B22,\"-\",U$1),'База выдачи'!$A:$F,5,0)),\"\",VLOOKUP(CONCATENATE($B22,\"-\",U$1),'База выдачи'!$A:$F,5,0)),VLOOKUP(CONCATENATE($B22,\"-\",U$1),База!$A:$G,5,0))","v":""},{"$f":"IF(ISERROR(VLOOKUP(CONCATENATE($B22,\"-\",U$1),База!$A:$G,6,0)),IF(ISERROR(VLOOKUP(CONCATENATE($B22,\"-\",U$1),'База выдачи'!$A:$F,6,0)),\"\",VLOOKUP(CONCATENATE($B22,\"-\",U$1),'База выдачи'!$A:$F,6,0)),VLOOKUP(CONCATENATE($B22,\"-\",U$1),База!$A:$G,6,0))","v":""},7,{"$f":"IF(ISERROR(VLOOKUP(CONCATENATE($B22,\"-\",X$1),База!$A:$G,5,0)),IF(ISERROR(VLOOKUP(CONCATENATE($B22,\"-\",X$1),'База выдачи'!$A:$F,5,0)),\"\",VLOOKUP(CONCATENATE($B22,\"-\",X$1),'База выдачи'!$A:$F,5,0)),VLOOKUP(CONCATENATE($B22,\"-\",X$1),База!$A:$G,5,0))","v":""},{"$f":"IF(ISERROR(VLOOKUP(CONCATENATE($B22,\"-\",X$1),База!$A:$G,6,0)),IF(ISERROR(VLOOKUP(CONCATENATE($B22,\"-\",X$1),'База выдачи'!$A:$F,6,0)),\"\",VLOOKUP(CONCATENATE($B22,\"-\",X$1),'База выдачи'!$A:$F,6,0)),VLOOKUP(CONCATENATE($B22,\"-\",X$1),База!$A:$G,6,0))","v":""},9,{"$f":"IF(ISERROR(VLOOKUP(CONCATENATE($B22,\"-\",AA$1),База!$A:$G,5,0)),IF(ISERROR(VLOOKUP(CONCATENATE($B22,\"-\",AA$1),'База выдачи'!$A:$F,5,0)),\"\",VLOOKUP(CONCATENATE($B22,\"-\",AA$1),'База выдачи'!$A:$F,5,0)),VLOOKUP(CONCATENATE($B22,\"-\",AA$1),База!$A:$G,5,0))","v":""},{"$f":"IF(ISERROR(VLOOKUP(CONCATENATE($B22,\"-\",AA$1),База!$A:$G,6,0)),IF(ISERROR(VLOOKUP(CONCATENATE($B22,\"-\",AA$1),'База выдачи'!$A:$F,6,0)),\"\",VLOOKUP(CONCATENATE($B22,\"-\",AA$1),'База выдачи'!$A:$F,6,0)),VLOOKUP(CONCATENATE($B22,\"-\",AA$1),База!$A:$G,6,0))","v":""},"F",{"$f":"IF(ISERROR(VLOOKUP(CONCATENATE($B22,\"-\",AD$1),База!$A:$G,5,0)),IF(ISERROR(VLOOKUP(CONCATENATE($B22,\"-\",AD$1),'База выдачи'!$A:$F,5,0)),\"\",VLOOKUP(CONCATENATE($B22,\"-\",AD$1),'База выдачи'!$A:$F,5,0)),VLOOKUP(CONCATENATE($B22,\"-\",AD$1),База!$A:$G,5,0))","v":""},{"$f":"IF(ISERROR(VLOOKUP(CONCATENATE($B22,\"-\",AD$1),База!$A:$G,6,0)),IF(ISERROR(VLOOKUP(CONCATENATE($B22,\"-\",AD$1),'База выдачи'!$A:$F,6,0)),\"\",VLOOKUP(CONCATENATE($B22,\"-\",AD$1),'База выдачи'!$A:$F,6,0)),VLOOKUP(CONCATENATE($B22,\"-\",AD$1),База!$A:$G,6,0))","v":""},"G",{"$f":"IF(ISERROR(VLOOKUP(CONCATENATE($B22,\"-\",AG$1),База!$A:$G,5,0)),IF(ISERROR(VLOOKUP(CONCATENATE($B22,\"-\",AG$1),'База выдачи'!$A:$F,5,0)),\"\",VLOOKUP(CONCATENATE($B22,\"-\",AG$1),'База выдачи'!$A:$F,5,0)),VLOOKUP(CONCATENATE($B22,\"-\",AG$1),База!$A:$G,5,0))","v":""},{"$f":"IF(ISERROR(VLOOKUP(CONCATENATE($B22,\"-\",AG$1),База!$A:$G,6,0)),IF(ISERROR(VLOOKUP(CONCATENATE($B22,\"-\",AG$1),'База выдачи'!$A:$F,6,0)),\"\",VLOOKUP(CONCATENATE($B22,\"-\",AG$1),'База выдачи'!$A:$F,6,0)),VLOOKUP(CONCATENATE($B22,\"-\",AG$1),База!$A:$G,6,0))","v":""},"H",{"$f":"IF(ISERROR(VLOOKUP(CONCATENATE($B22,\"-\",AJ$1),База!$A:$G,5,0)),IF(ISERROR(VLOOKUP(CONCATENATE($B22,\"-\",AJ$1),'База выдачи'!$A:$F,5,0)),\"\",VLOOKUP(CONCATENATE($B22,\"-\",AJ$1),'База выдачи'!$A:$F,5,0)),VLOOKUP(CONCATENATE($B22,\"-\",AJ$1),База!$A:$G,5,0))","v":""},{"$f":"IF(ISERROR(VLOOKUP(CONCATENATE($B22,\"-\",AJ$1),База!$A:$G,6,0)),IF(ISERROR(VLOOKUP(CONCATENATE($B22,\"-\",AJ$1),'База выдачи'!$A:$F,6,0)),\"\",VLOOKUP(CONCATENATE($B22,\"-\",AJ$1),'База выдачи'!$A:$F,6,0)),VLOOKUP(CONCATENATE($B22,\"-\",AJ$1),База!$A:$G,6,0))","v":""},"I",{"$f":"IF(ISERROR(VLOOKUP(CONCATENATE($B22,\"-\",AM$1),База!$A:$G,5,0)),IF(ISERROR(VLOOKUP(CONCATENATE($B22,\"-\",AM$1),'База выдачи'!$A:$F,5,0)),\"\",VLOOKUP(CONCATENATE($B22,\"-\",AM$1),'База выдачи'!$A:$F,5,0)),VLOOKUP(CONCATENATE($B22,\"-\",AM$1),База!$A:$G,5,0))","v":""},{"$f":"IF(ISERROR(VLOOKUP(CONCATENATE($B22,\"-\",AM$1),База!$A:$G,6,0)),IF(ISERROR(VLOOKUP(CONCATENATE($B22,\"-\",AM$1),'База выдачи'!$A:$F,6,0)),\"\",VLOOKUP(CONCATENATE($B22,\"-\",AM$1),'База выдачи'!$A:$F,6,0)),VLOOKUP(CONCATENATE($B22,\"-\",AM$1),База!$A:$G,6,0))","v":""},"J",{"$f":"IF(ISERROR(VLOOKUP(CONCATENATE($B22,\"-\",AP$1),База!$A:$G,5,0)),IF(ISERROR(VLOOKUP(CONCATENATE($B22,\"-\",AP$1),'База выдачи'!$A:$F,5,0)),\"\",VLOOKUP(CONCATENATE($B22,\"-\",AP$1),'База выдачи'!$A:$F,5,0)),VLOOKUP(CONCATENATE($B22,\"-\",AP$1),База!$A:$G,5,0))","v":""},{"$f":"IF(ISERROR(VLOOKUP(CONCATENATE($B22,\"-\",AP$1),База!$A:$G,6,0)),IF(ISERROR(VLOOKUP(CONCATENATE($B22,\"-\",AP$1),'База выдачи'!$A:$F,6,0)),\"\",VLOOKUP(CONCATENATE($B22,\"-\",AP$1),'База выдачи'!$A:$F,6,0)),VLOOKUP(CONCATENATE($B22,\"-\",AP$1),База!$A:$G,6,0))","v":""},"K",{"$f":"IF(ISERROR(VLOOKUP(CONCATENATE($B22,\"-\",AS$1),База!$A:$G,5,0)),IF(ISERROR(VLOOKUP(CONCATENATE($B22,\"-\",AS$1),'База выдачи'!$A:$F,5,0)),\"\",VLOOKUP(CONCATENATE($B22,\"-\",AS$1),'База выдачи'!$A:$F,5,0)),VLOOKUP(CONCATENATE($B22,\"-\",AS$1),База!$A:$G,5,0))","v":""},{"$f":"IF(ISERROR(VLOOKUP(CONCATENATE($B22,\"-\",AS$1),База!$A:$G,6,0)),IF(ISERROR(VLOOKUP(CONCATENATE($B22,\"-\",AS$1),'База выдачи'!$A:$F,6,0)),\"\",VLOOKUP(CONCATENATE($B22,\"-\",AS$1),'База выдачи'!$A:$F,6,0)),VLOOKUP(CONCATENATE($B22,\"-\",AS$1),База!$A:$G,6,0))","v":""},null,null,{"$f":"COUNTIFS(База!B:B,Статистика!B22,База!E:E,\"OK\")","v":4},{"$f":"CS3","v":"02:39:58.920"},9599,{"$f":"COUNTIFS(База!B:B,Статистика!B22,База!E:E,\"XXXX\")","v":1},{"$f":"IF(AX22+AZ22+BA22=0,ксекундвигре-BD22,ксекундвигре*Статистика!AX22+(ксекундвигре-Статистика!AZ22)+Статистика!BA22)","v":44702},54165,20,12]
[21,{"$f":"IF(ISERROR(VLOOKUP(A23,Служебный!B:C,2,0)),\"\",A23&\"-\"&VLOOKUP(A23,Служебный!B:C,2,0))","v":"21-Партизаны Германа"},3,{"$f":"IF(ISERROR(VLOOKUP(CONCATENATE($B23,\"-\",C$1),База!$A:$G,5,0)),IF(ISERROR(VLOOKUP(CONCATENATE($B23,\"-\",C$1),'База выдачи'!$A:$F,5,0)),\"\",VLOOKUP(CONCATENATE($B23,\"-\",C$1),'База выдачи'!$A:$F,5,0)),VLOOKUP(CONCATENATE($B23,\"-\",C$1),База!$A:$G,5,0))","v":"OK"},{"$f":"IF(ISERROR(VLOOKUP(CONCATENATE($B23,\"-\",C$1),База!$A:$G,6,0)),IF(ISERROR(VLOOKUP(CONCATENATE($B23,\"-\",C$1),'База выдачи'!$A:$F,6,0)),\"\",VLOOKUP(CONCATENATE($B23,\"-\",C$1),'База выдачи'!$A:$F,6,0)),VLOOKUP(CONCATENATE($B23,\"-\",C$1),База!$A:$G,6,0))","v":"01:24:44.360"},1,{"$f":"IF(ISERROR(VLOOKUP(CONCATENATE($B23,\"-\",F$1),База!$A:$G,5,0)),IF(ISERROR(VLOOKUP(CONCATENATE($B23,\"-\",F$1),'База выдачи'!$A:$F,5,0)),\"\",VLOOKUP(CONCATENATE($B23,\"-\",F$1),'База выдачи'!$A:$F,5,0)),VLOOKUP(CONCATENATE($B23,\"-\",F$1),База!$A:$G,5,0))","v":"XXXX"},{"$f":"IF(ISERROR(VLOOKUP(CONCATENATE($B23,\"-\",F$1),База!$A:$G,6,0)),IF(ISERROR(VLOOKUP(CONCATENATE($B23,\"-\",F$1),'База выдачи'!$A:$F,6,0)),\"\",VLOOKUP(CONCATENATE($B23,\"-\",F$1),'База выдачи'!$A:$F,6,0)),VLOOKUP(CONCATENATE($B23,\"-\",F$1),База!$A:$G,6,0))","v":"01:26:57.640"},8,{"$f":"IF(ISERROR(VLOOKUP(CONCATENATE($B23,\"-\",I$1),База!$A:$G,5,0)),IF(ISERROR(VLOOKUP(CONCATENATE($B23,\"-\",I$1),'База выдачи'!$A:$F,5,0)),\"\",VLOOKUP(CONCATENATE($B23,\"-\",I$1),'База выдачи'!$A:$F,5,0)),VLOOKUP(CONCATENATE($B23,\"-\",I$1),База!$A:$G,5,0))","v":"OK"},{"$f":"IF(ISERROR(VLOOKUP(CONCATENATE($B23,\"-\",I$1),База!$A:$G,6,0)),IF(ISERROR(VLOOKUP(CONCATENATE($B23,\"-\",I$1),'База выдачи'!$A:$F,6,0)),\"\",VLOOKUP(CONCATENATE($B23,\"-\",I$1),'База выдачи'!$A:$F,6,0)),VLOOKUP(CONCATENATE($B23,\"-\",I$1),База!$A:$G,6,0))","v":"01:59:36.190"},4,{"$f":"IF(ISERROR(VLOOKUP(CONCATENATE($B23,\"-\",L$1),База!$A:$G,5,0)),IF(ISERROR(VLOOKUP(CONCATENATE($B23,\"-\",L$1),'База выдачи'!$A:$F,5,0)),\"\",VLOOKUP(CONCATENATE($B23,\"-\",L$1),'База выдачи'!$A:$F,5,0)),VLOOKUP(CONCATENATE($B23,\"-\",L$1),База!$A:$G,5,0))","v":"OK"},{"$f":"IF(ISERROR(VLOOKUP(CONCATENATE($B23,\"-\",L$1),База!$A:$G,6,0)),IF(ISERROR(VLOOKUP(CONCATENATE($B23,\"-\",L$1),'База выдачи'!$A:$F,6,0)),\"\",VLOOKUP(CONCATENATE($B23,\"-\",L$1),'База выдачи'!$A:$F,6,0)),VLOOKUP(CONCATENATE($B23,\"-\",L$1),База!$A:$G,6,0))","v":"02:08:54.730"},9,{"$f":"IF(ISERROR(VLOOKUP(CONCATENATE($B23,\"-\",O$1),База!$A:$G,5,0)),IF(ISERROR(VLOOKUP(CONCATENATE($B23,\"-\",O$1),'База выдачи'!$A:$F,5,0)),\"\",VLOOKUP(CONCATENATE($B23,\"-\",O$1),'База выдачи'!$A:$F,5,0)),VLOOKUP(CONCATENATE($B23,\"-\",O$1),База!$A:$G,5,0))","v":"OK"},{"$f":"IF(ISERROR(VLOOKUP(CONCATENATE($B23,\"-\",O$1),База!$A:$G,6,0)),IF(ISERROR(VLOOKUP(CONCATENATE($B23,\"-\",O$1),'База выдачи'!$A:$F,6,0)),\"\",VLOOKUP(CONCATENATE($B23,\"-\",O$1),'База выдачи'!$A:$F,6,0)),VLOOKUP(CONCATENATE($B23,\"-\",O$1),База!$A:$G,6,0))","v":"02:09:14.860"},7,{"$f":"IF(ISERROR(VLOOKUP(CONCATENATE($B23,\"-\",R$1),База!$A:$G,5,0)),IF(ISERROR(VLOOKUP(CONCATENATE($B23,\"-\",R$1),'База выдачи'!$A:$F,5,0)),\"\",VLOOKUP(CONCATENATE($B23,\"-\",R$1),'База выдачи'!$A:$F,5,0)),VLOOKUP(CONCATENATE($B23,\"-\",R$1),База!$A:$G,5,0))","v":"OK"},{"$f":"IF(ISERROR(VLOOKUP(CONCATENATE($B23,\"-\",R$1),База!$A:$G,6,0)),IF(ISERROR(VLOOKUP(CONCATENATE($B23,\"-\",R$1),'База выдачи'!$A:$F,6,0)),\"\",VLOOKUP(CONCATENATE($B23,\"-\",R$1),'База выдачи'!$A:$F,6,0)),VLOOKUP(CONCATENATE($B23,\"-\",R$1),База!$A:$G,6,0))","v":"02:31:09.770"},2,{"$f":"IF(ISERROR(VLOOKUP(CONCATENATE($B23,\"-\",U$1),База!$A:$G,5,0)),IF(ISERROR(VLOOKUP(CONCATENATE($B23,\"-\",U$1),'База выдачи'!$A:$F,5,0)),\"\",VLOOKUP(CONCATENATE($B23,\"-\",U$1),'База выдачи'!$A:$F,5,0)),VLOOKUP(CONCATENATE($B23,\"-\",U$1),База!$A:$G,5,0))","v":"OK"},{"$f":"IF(ISERROR(VLOOKUP(CONCATENATE($B23,\"-\",U$1),База!$A:$G,6,0)),IF(ISERROR(VLOOKUP(CONCATENATE($B23,\"-\",U$1),'База выдачи'!$A:$F,6,0)),\"\",VLOOKUP(CONCATENATE($B23,\"-\",U$1),'База выдачи'!$A:$F,6,0)),VLOOKUP(CONCATENATE($B23,\"-\",U$1),База!$A:$G,6,0))","v":"03:00:14.250"},5,{"$f":"IF(ISERROR(VLOOKUP(CONCATENATE($B23,\"-\",X$1),База!$A:$G,5,0)),IF(ISERROR(VLOOKUP(CONCATENATE($B23,\"-\",X$1),'База выдачи'!$A:$F,5,0)),\"\",VLOOKUP(CONCATENATE($B23,\"-\",X$1),'База выдачи'!$A:$F,5,0)),VLOOKUP(CONCATENATE($B23,\"-\",X$1),База!$A:$G,5,0))","v":"ST"},{"$f":"IF(ISERROR(VLOOKUP(CONCATENATE($B23,\"-\",X$1),База!$A:$G,6,0)),IF(ISERROR(VLOOKUP(CONCATENATE($B23,\"-\",X$1),'База выдачи'!$A:$F,6,0)),\"\",VLOOKUP(CONCATENATE($B23,\"-\",X$1),'База выдачи'!$A:$F,6,0)),VLOOKUP(CONCATENATE($B23,\"-\",X$1),База!$A:$G,6,0))","v":"03:00:16.220"},6,{"$f":"IF(ISERROR(VLOOKUP(CONCATENATE($B23,\"-\",AA$1),База!$A:$G,5,0)),IF(ISERROR(VLOOKUP(CONCATENATE($B23,\"-\",AA$1),'База выдачи'!$A:$F,5,0)),\"\",VLOOKUP(CONCATENATE($B23,\"-\",AA$1),'База выдачи'!$A:$F,5,0)),VLOOKUP(CONCATENATE($B23,\"-\",AA$1),База!$A:$G,5,0))","v":""},{"$f":"IF(ISERROR(VLOOKUP(CONCATENATE($B23,\"-\",AA$1),База!$A:$G,6,0)),IF(ISERROR(VLOOKUP(CONCATENATE($B23,\"-\",AA$1),'База выдачи'!$A:$F,6,0)),\"\",VLOOKUP(CONCATENATE($B23,\"-\",AA$1),'База выдачи'!$A:$F,6,0)),VLOOKUP(CONCATENATE($B23,\"-\",AA$1),База!$A:$G,6,0))","v":""},"E",{"$f":"IF(ISERROR(VLOOKUP(CONCATENATE($B23,\"-\",AD$1),База!$A:$G,5,0)),IF(ISERROR(VLOOKUP(CONCATENATE($B23,\"-\",AD$1),'База выдачи'!$A:$F,5,0)),\"\",VLOOKUP(CONCATENATE($B23,\"-\",AD$1),'База выдачи'!$A:$F,5,0)),VLOOKUP(CONCATENATE($B23,\"-\",AD$1),База!$A:$G,5,0))","v":""},{"$f":"IF(ISERROR(VLOOKUP(CONCATENATE($B23,\"-\",AD$1),База!$A:$G,6,0)),IF(ISERROR(VLOOKUP(CONCATENATE($B23,\"-\",AD$1),'База выдачи'!$A:$F,6,0)),\"\",VLOOKUP(CONCATENATE($B23,\"-\",AD$1),'База выдачи'!$A:$F,6,0)),VLOOKUP(CONCATENATE($B23,\"-\",AD$1),База!$A:$G,6,0))","v":""},"F",{"$f":"IF(ISERROR(VLOOKUP(CONCATENATE($B23,\"-\",AG$1),База!$A:$G,5,0)),IF(ISERROR(VLOOKUP(CONCATENATE($B23,\"-\",AG$1),'База выдачи'!$A:$F,5,0)),\"\",VLOOKUP(CONCATENATE($B23,\"-\",AG$1),'База выдачи'!$A:$F,5,0)),VLOOKUP(CONCATENATE($B23,\"-\",AG$1),База!$A:$G,5,0))","v":""},{"$f":"IF(ISERROR(VLOOKUP(CONCATENATE($B23,\"-\",AG$1),База!$A:$G,6,0)),IF(ISERROR(VLOOKUP(CONCATENATE($B23,\"-\",AG$1),'База выдачи'!$A:$F,6,0)),\"\",VLOOKUP(CONCATENATE($B23,\"-\",AG$1),'База выдачи'!$A:$F,6,0)),VLOOKUP(CONCATENATE($B23,\"-\",AG$1),База!$A:$G,6,0))","v":""},"G",{"$f":"IF(ISERROR(VLOOKUP(CONCATENATE($B23,\"-\",AJ$1),База!$A:$G,5,0)),IF(ISERROR(VLOOKUP(CONCATENATE($B23,\"-\",AJ$1),'База выдачи'!$A:$F,5,0)),\"\",VLOOKUP(CONCATENATE($B23,\"-\",AJ$1),'База выдачи'!$A:$F,5,0)),VLOOKUP(CONCATENATE($B23,\"-\",AJ$1),База!$A:$G,5,0))","v":""},{"$f":"IF(ISERROR(VLOOKUP(CONCATENATE($B23,\"-\",AJ$1),База!$A:$G,6,0)),IF(ISERROR(VLOOKUP(CONCATENATE($B23,\"-\",AJ$1),'База выдачи'!$A:$F,6,0)),\"\",VLOOKUP(CONCATENATE($B23,\"-\",AJ$1),'База выдачи'!$A:$F,6,0)),VLOOKUP(CONCATENATE($B23,\"-\",AJ$1),База!$A:$G,6,0))","v":""},"H",{"$f":"IF(ISERROR(VLOOKUP(CONCATENATE($B23,\"-\",AM$1),База!$A:$G,5,0)),IF(ISERROR(VLOOKUP(CONCATENATE($B23,\"-\",AM$1),'База выдачи'!$A:$F,5,0)),\"\",VLOOKUP(CONCATENATE($B23,\"-\",AM$1),'База выдачи'!$A:$F,5,0)),VLOOKUP(CONCATENATE($B23,\"-\",AM$1),База!$A:$G,5,0))","v":""},{"$f":"IF(ISERROR(VLOOKUP(CONCATENATE($B23,\"-\",AM$1),База!$A:$G,6,0)),IF(ISERROR(VLOOKUP(CONCATENATE($B23,\"-\",AM$1),'База выдачи'!$A:$F,6,0)),\"\",VLOOKUP(CONCATENATE($B23,\"-\",AM$1),'База выдачи'!$A:$F,6,0)),VLOOKUP(CONCATENATE($B23,\"-\",AM$1),База!$A:$G,6,0))","v":""},"I",{"$f":"IF(ISERROR(VLOOKUP(CONCATENATE($B23,\"-\",AP$1),База!$A:$G,5,0)),IF(ISERROR(VLOOKUP(CONCATENATE($B23,\"-\",AP$1),'База выдачи'!$A:$F,5,0)),\"\",VLOOKUP(CONCATENATE($B23,\"-\",AP$1),'База выдачи'!$A:$F,5,0)),VLOOKUP(CONCATENATE($B23,\"-\",AP$1),База!$A:$G,5,0))","v":""},{"$f":"IF(ISERROR(VLOOKUP(CONCATENATE($B23,\"-\",AP$1),База!$A:$G,6,0)),IF(ISERROR(VLOOKUP(CONCATENATE($B23,\"-\",AP$1),'База выдачи'!$A:$F,6,0)),\"\",VLOOKUP(CONCATENATE($B23,\"-\",AP$1),'База выдачи'!$A:$F,6,0)),VLOOKUP(CONCATENATE($B23,\"-\",AP$1),База!$A:$G,6,0))","v":""},"J",{"$f":"IF(ISERROR(VLOOKUP(CONCATENATE($B23,\"-\",AS$1),База!$A:$G,5,0)),IF(ISERROR(VLOOKUP(CONCATENATE($B23,\"-\",AS$1),'База выдачи'!$A:$F,5,0)),\"\",VLOOKUP(CONCATENATE($B23,\"-\",AS$1),'База выдачи'!$A:$F,5,0)),VLOOKUP(CONCATENATE($B23,\"-\",AS$1),База!$A:$G,5,0))","v":""},{"$f":"IF(ISERROR(VLOOKUP(CONCATENATE($B23,\"-\",AS$1),База!$A:$G,6,0)),IF(ISERROR(VLOOKUP(CONCATENATE($B23,\"-\",AS$1),'База выдачи'!$A:$F,6,0)),\"\",VLOOKUP(CONCATENATE($B23,\"-\",AS$1),'База выдачи'!$A:$F,6,0)),VLOOKUP(CONCATENATE($B23,\"-\",AS$1),База!$A:$G,6,0))","v":""},null,null,{"$f":"COUNTIFS(База!B:B,Статистика!B23,База!E:E,\"OK\")","v":6},{"$f":"CU3","v":"03:00:14.250"},10814,{"$f":"COUNTIFS(База!B:B,Статистика!B23,База!E:E,\"XXXX\")","v":1},{"$f":"IF(AX23+AZ23+BA23=0,ксекундвигре-BD23,ксекундвигре*Статистика!AX23+(ксекундвигре-Статистика!AZ23)+Статистика!BA23)","v":65207},45006,21,7]
[22,{"$f":"IF(ISERROR(VLOOKUP(A24,Служебный!B:C,2,0)),\"\",A24&\"-\"&VLOOKUP(A24,Служебный!B:C,2,0))","v":"22-СанчеЗ&Ко"},4,{"$f":"IF(ISERROR(VLOOKUP(CONCATENATE($B24,\"-\",C$1),База!$A:$G,5,0)),IF(ISERROR(VLOOKUP(CONCATENATE($B24,\"-\",C$1),'База выдачи'!$A:$F,5,0)),\"\",VLOOKUP(CONCATENATE($B24,\"-\",C$1),'База выдачи'!$A:$F,5,0)),VLOOKUP(CONCATENATE($B24,\"-\",C$1),База!$A:$G,5,0))","v":"OK"},{"$f":"IF(ISERROR(VLOOKUP(CONCATENATE($B24,\"-\",C$1),База!$A:$G,6,0)),IF(ISERROR(VLOOKUP(CONCATENATE($B24,\"-\",C$1),'База выдачи'!$A:$F,6,0)),\"\",VLOOKUP(CONCATENATE($B24,\"-\",C$1),'База выдачи'!$A:$F,6,0)),VLOOKUP(CONCATENATE($B24,\"-\",C$1),База!$A:$G,6,0))","v":"00:39:37.710"},7,{"$f":"IF(ISERROR(VLOOKUP(CONCATENATE($B24,\"-\",F$1),База!$A:$G,5,0)),IF(ISERROR(VLOOKUP(CONCATENATE($B24,\"-\",F$1),'База выдачи'!$A:$F,5,0)),\"\",VLOOKUP(CONCATENATE($B24,\"-\",F$1),'База выдачи'!$A:$F,5,0)),VLOOKUP(CONCATENATE($B24,\"-\",F$1),База!$A:$G,5,0))","v":"OK"},{"$f":"IF(ISERROR(VLOOKUP(CONCATENATE($B24,\"-\",F$1),База!$A:$G,6,0)),IF(ISERROR(VLOOKUP(CONCATENATE($B24,\"-\",F$1),'База выдачи'!$A:$F,6,0)),\"\",VLOOKUP(CONCATENATE($B24,\"-\",F$1),'База выдачи'!$A:$F,6,0)),VLOOKUP(CONCATENATE($B24,\"-\",F$1),База!$A:$G,6,0))","v":"00:53:17.410"},5,{"$f":"IF(ISERROR(VLOOKUP(CONCATENATE($B24,\"-\",I$1),База!$A:$G,5,0)),IF(ISERROR(VLOOKUP(CONCATENATE($B24,\"-\",I$1),'База выдачи'!$A:$F,5,0)),\"\",VLOOKUP(CONCATENATE($B24,\"-\",I$1),'База выдачи'!$A:$F,5,0)),VLOOKUP(CONCATENATE($B24,\"-\",I$1),База!$A:$G,5,0))","v":"OK"},{"$f":"IF(ISERROR(VLOOKUP(CONCATENATE($B24,\"-\",I$1),База!$A:$G,6,0)),IF(ISERROR(VLOOKUP(CONCATENATE($B24,\"-\",I$1),'База выдачи'!$A:$F,6,0)),\"\",VLOOKUP(CONCATENATE($B24,\"-\",I$1),'База выдачи'!$A:$F,6,0)),VLOOKUP(CONCATENATE($B24,\"-\",I$1),База!$A:$G,6,0))","v":"01:10:44.980"},3,{"$f":"IF(ISERROR(VLOOKUP(CONCATENATE($B24,\"-\",L$1),База!$A:$G,5,0)),IF(ISERROR(VLOOKUP(CONCATENATE($B24,\"-\",L$1),'База выдачи'!$A:$F,5,0)),\"\",VLOOKUP(CONCATENATE($B24,\"-\",L$1),'База выдачи'!$A:$F,5,0)),VLOOKUP(CONCATENATE($B24,\"-\",L$1),База!$A:$G,5,0))","v":"OK"},{"$f":"IF(ISERROR(VLOOKUP(CONCATENATE($B24,\"-\",L$1),База!$A:$G,6,0)),IF(ISERROR(VLOOKUP(CONCATENATE($B24,\"-\",L$1),'База выдачи'!$A:$F,6,0)),\"\",VLOOKUP(CONCATENATE($B24,\"-\",L$1),'База выдачи'!$A:$F,6,0)),VLOOKUP(CONCATENATE($B24,\"-\",L$1),База!$A:$G,6,0))","v":"01:29:22.640"},2,{"$f":"IF(ISERROR(VLOOKUP(CONCATENATE($B24,\"-\",O$1),База!$A:$G,5,0)),IF(ISERROR(VLOOKUP(CONCATENATE($B24,\"-\",O$1),'База выдачи'!$A:$F,5,0)),\"\",VLOOKUP(CONCATENATE($B24,\"-\",O$1),'База выдачи'!$A:$F,5,0)),VLOOKUP(CONCATENATE($B24,\"-\",O$1),База!$A:$G,5,0))","v":"OK"},{"$f":"IF(ISERROR(VLOOKUP(CONCATENATE($B24,\"-\",O$1),База!$A:$G,6,0)),IF(ISERROR(VLOOKUP(CONCATENATE($B24,\"-\",O$1),'База выдачи'!$A:$F,6,0)),\"\",VLOOKUP(CONCATENATE($B24,\"-\",O$1),'База выдачи'!$A:$F,6,0)),VLOOKUP(CONCATENATE($B24,\"-\",O$1),База!$A:$G,6,0))","v":"01:47:56.470"},1,{"$f":"IF(ISERROR(VLOOKUP(CONCATENATE($B24,\"-\",R$1),База!$A:$G,5,0)),IF(ISERROR(VLOOKUP(CONCATENATE($B24,\"-\",R$1),'База выдачи'!$A:$F,5,0)),\"\",VLOOKUP(CONCATENATE($B24,\"-\",R$1),'База выдачи'!$A:$F,5,0)),VLOOKUP(CONCATENATE($B24,\"-\",R$1),База!$A:$G,5,0))","v":"XXXX"},{"$f":"IF(ISERROR(VLOOKUP(CONCATENATE($B24,\"-\",R$1),База!$A:$G,6,0)),IF(ISERROR(VLOOKUP(CONCATENATE($B24,\"-\",R$1),'База выдачи'!$A:$F,6,0)),\"\",VLOOKUP(CONCATENATE($B24,\"-\",R$1),'База выдачи'!$A:$F,6,0)),VLOOKUP(CONCATENATE($B24,\"-\",R$1),База!$A:$G,6,0))","v":"02:26:27.370"},6,{"$f":"IF(ISERROR(VLOOKUP(CONCATENATE($B24,\"-\",U$1),База!$A:$G,5,0)),IF(ISERROR(VLOOKUP(CONCATENATE($B24,\"-\",U$1),'База выдачи'!$A:$F,5,0)),\"\",VLOOKUP(CONCATENATE($B24,\"-\",U$1),'База выдачи'!$A:$F,5,0)),VLOOKUP(CONCATENATE($B24,\"-\",U$1),База!$A:$G,5,0))","v":"ST"},{"$f":"IF(ISERROR(VLOOKUP(CONCATENATE($B24,\"-\",U$1),База!$A:$G,6,0)),IF(ISERROR(VLOOKUP(CONCATENATE($B24,\"-\",U$1),'База выдачи'!$A:$F,6,0)),\"\",VLOOKUP(CONCATENATE($B24,\"-\",U$1),'База выдачи'!$A:$F,6,0)),VLOOKUP(CONCATENATE($B24,\"-\",U$1),База!$A:$G,6,0))","v":"02:26:29.250"},9,{"$f":"IF(ISERROR(VLOOKUP(CONCATENATE($B24,\"-\",X$1),База!$A:$G,5,0)),IF(ISERROR(VLOOKUP(CONCATENATE($B24,\"-\",X$1),'База выдачи'!$A:$F,5,0)),\"\",VLOOKUP(CONCATENATE($B24,\"-\",X$1),'База выдачи'!$A:$F,5,0)),VLOOKUP(CONCATENATE($B24,\"-\",X$1),База!$A:$G,5,0))","v":""},{"$f":"IF(ISERROR(VLOOKUP(CONCATENATE($B24,\"-\",X$1),База!$A:$G,6,0)),IF(ISERROR(VLOOKUP(CONCATENATE($B24,\"-\",X$1),'База выдачи'!$A:$F,6,0)),\"\",VLOOKUP(CONCATENATE($B24,\"-\",X$1),'База выдачи'!$A:$F,6,0)),VLOOKUP(CONCATENATE($B24,\"-\",X$1),База!$A:$G,6,0))","v":""},8,{"$f":"IF(ISERROR(VLOOKUP(CONCATENATE($B24,\"-\",AA$1),База!$A:$G,5,0)),IF(ISERROR(VLOOKUP(CONCATENATE($B24,\"-\",AA$1),'База выдачи'!$A:$F,5,0)),\"\",VLOOKUP(CONCATENATE($B24,\"-\",AA$1),'База выдачи'!$A:$F,5,0)),VLOOKUP(CONCATENATE($B24,\"-\",AA$1),База!$A:$G,5,0))","v":""},{"$f":"IF(ISERROR(VLOOKUP(CONCATENATE($B24,\"-\",AA$1),База!$A:$G,6,0)),IF(ISERROR(VLOOKUP(CONCATENATE($B24,\"-\",AA$1),'База выдачи'!$A:$F,6,0)),\"\",VLOOKUP(CONCATENATE($B24,\"-\",AA$1),'База выдачи'!$A:$F,6,0)),VLOOKUP(CONCATENATE($B24,\"-\",AA$1),База!$A:$G,6,0))","v":""},"D",{"$f":"IF(ISERROR(VLOOKUP(CONCATENATE($B24,\"-\",AD$1),База!$A:$G,5,0)),IF(ISERROR(VLOOKUP(CONCATENATE($B24,\"-\",AD$1),'База выдачи'!$A:$F,5,0)),\"\",VLOOKUP(CONCATENATE($B24,\"-\",AD$1),'База выдачи'!$A:$F,5,0)),VLOOKUP(CONCATENATE($B24,\"-\",AD$1),База!$A:$G,5,0))","v":""},{"$f":"IF(ISERROR(VLOOKUP(CONCATENATE($B24,\"-\",AD$1),База!$A:$G,6,0)),IF(ISERROR(VLOOKUP(CONCATENATE($B24,\"-\",AD$1),'База выдачи'!$A:$F,6,0)),\"\",VLOOKUP(CONCATENATE($B24,\"-\",AD$1),'База выдачи'!$A:$F,6,0)),VLOOKUP(CONCATENATE($B24,\"-\",AD$1),База!$A:$G,6,0))","v":""},"E",{"$f":"IF(ISERROR(VLOOKUP(CONCATENATE($B24,\"-\",AG$1),База!$A:$G,5,0)),IF(ISERROR(VLOOKUP(CONCATENATE($B24,\"-\",AG$1),'База выдачи'!$A:$F,5,0)),\"\",VLOOKUP(CONCATENATE($B24,\"-\",AG$1),'База выдачи'!$A:$F,5,0)),VLOOKUP(CONCATENATE($B24,\"-\",AG$1),База!$A:$G,5,0))","v":""},{"$f":"IF(ISERROR(VLOOKUP(CONCATENATE($B24,\"-\",AG$1),База!$A:$G,6,0)),IF(ISERROR(VLOOKUP(CONCATENATE($B24,\"-\",AG$1),'База выдачи'!$A:$F,6,0)),\"\",VLOOKUP(CONCATENATE($B24,\"-\",AG$1),'База выдачи'!$A:$F,6,0)),VLOOKUP(CONCATENATE($B24,\"-\",AG$1),База!$A:$G,6,0))","v":""},"F",{"$f":"IF(ISERROR(VLOOKUP(CONCATENATE($B24,\"-\",AJ$1),База!$A:$G,5,0)),IF(ISERROR(VLOOKUP(CONCATENATE($B24,\"-\",AJ$1),'База выдачи'!$A:$F,5,0)),\"\",VLOOKUP(CONCATENATE($B24,\"-\",AJ$1),'База выдачи'!$A:$F,5,0)),VLOOKUP(CONCATENATE($B24,\"-\",AJ$1),База!$A:$G,5,0))","v":""},{"$f":"IF(ISERROR(VLOOKUP(CONCATENATE($B24,\"-\",AJ$1),База!$A:$G,6,0)),IF(ISERROR(VLOOKUP(CONCATENATE($B24,\"-\",AJ$1),'База выдачи'!$A:$F,6,0)),\"\",VLOOKUP(CONCATENATE($B24,\"-\",AJ$1),'База выдачи'!$A:$F,6,0)),VLOOKUP(CONCATENATE($B24,\"-\",AJ$1),База!$A:$G,6,0))","v":""},"G",{"$f":"IF(ISERROR(VLOOKUP(CONCATENATE($B24,\"-\",AM$1),База!$A:$G,5,0)),IF(ISERROR(VLOOKUP(CONCATENATE($B24,\"-\",AM$1),'База выдачи'!$A:$F,5,0)),\"\",VLOOKUP(CONCATENATE($B24,\"-\",AM$1),'База выдачи'!$A:$F,5,0)),VLOOKUP(CONCATENATE($B24,\"-\",AM$1),База!$A:$G,5,0))","v":""},{"$f":"IF(ISERROR(VLOOKUP(CONCATENATE($B24,\"-\",AM$1),База!$A:$G,6,0)),IF(ISERROR(VLOOKUP(CONCATENATE($B24,\"-\",AM$1),'База выдачи'!$A:$F,6,0)),\"\",VLOOKUP(CONCATENATE($B24,\"-\",AM$1),'База выдачи'!$A:$F,6,0)),VLOOKUP(CONCATENATE($B24,\"-\",AM$1),База!$A:$G,6,0))","v":""},"H",{"$f":"IF(ISERROR(VLOOKUP(CONCATENATE($B24,\"-\",AP$1),База!$A:$G,5,0)),IF(ISERROR(VLOOKUP(CONCATENATE($B24,\"-\",AP$1),'База выдачи'!$A:$F,5,0)),\"\",VLOOKUP(CONCATENATE($B24,\"-\",AP$1),'База выдачи'!$A:$F,5,0)),VLOOKUP(CONCATENATE($B24,\"-\",AP$1),База!$A:$G,5,0))","v":""},{"$f":"IF(ISERROR(VLOOKUP(CONCATENATE($B24,\"-\",AP$1),База!$A:$G,6,0)),IF(ISERROR(VLOOKUP(CONCATENATE($B24,\"-\",AP$1),'База выдачи'!$A:$F,6,0)),\"\",VLOOKUP(CONCATENATE($B24,\"-\",AP$1),'База выдачи'!$A:$F,6,0)),VLOOKUP(CONCATENATE($B24,\"-\",AP$1),База!$A:$G,6,0))","v":""},"I",{"$f":"IF(ISERROR(VLOOKUP(CONCATENATE($B24,\"-\",AS$1),База!$A:$G,5,0)),IF(ISERROR(VLOOKUP(CONCATENATE($B24,\"-\",AS$1),'База выдачи'!$A:$F,5,0)),\"\",VLOOKUP(CONCATENATE($B24,\"-\",AS$1),'База выдачи'!$A:$F,5,0)),VLOOKUP(CONCATENATE($B24,\"-\",AS$1),База!$A:$G,5,0))","v":""},{"$f":"IF(ISERROR(VLOOKUP(CONCATENATE($B24,\"-\",AS$1),База!$A:$G,6,0)),IF(ISERROR(VLOOKUP(CONCATENATE($B24,\"-\",AS$1),'База выдачи'!$A:$F,6,0)),\"\",VLOOKUP(CONCATENATE($B24,\"-\",AS$1),'База выдачи'!$A:$F,6,0)),VLOOKUP(CONCATENATE($B24,\"-\",AS$1),База!$A:$G,6,0))","v":""},null,null,{"$f":"COUNTIFS(База!B:B,Статистика!B24,База!E:E,\"OK\")","v":5},{"$f":"CW3","v":"01:47:56.470"},6476,{"$f":"COUNTIFS(База!B:B,Статистика!B24,База!E:E,\"XXXX\")","v":1},{"$f":"IF(AX24+AZ24+BA24=0,ксекундвигре-BD24,ксекундвигре*Статистика!AX24+(ксекундвигре-Статистика!AZ24)+Статистика!BA24)","v":58685},44834,22,28]
[23,{"$f":"IF(ISERROR(VLOOKUP(A25,Служебный!B:C,2,0)),\"\",A25&\"-\"&VLOOKUP(A25,Служебный!B:C,2,0))","v":"23-Мышь "},5,{"$f":"IF(ISERROR(VLOOKUP(CONCATENATE($B25,\"-\",C$1),База!$A:$G,5,0)),IF(ISERROR(VLOOKUP(CONCATENATE($B25,\"-\",C$1),'База выдачи'!$A:$F,5,0)),\"\",VLOOKUP(CONCATENATE($B25,\"-\",C$1),'База выдачи'!$A:$F,5,0)),VLOOKUP(CONCATENATE($B25,\"-\",C$1),База!$A:$G,5,0))","v":"XXXX"},{"$f":"IF(ISERROR(VLOOKUP(CONCATENATE($B25,\"-\",C$1),База!$A:$G,6,0)),IF(ISERROR(VLOOKUP(CONCATENATE($B25,\"-\",C$1),'База выдачи'!$A:$F,6,0)),\"\",VLOOKUP(CONCATENATE($B25,\"-\",C$1),'База выдачи'!$A:$F,6,0)),VLOOKUP(CONCATENATE($B25,\"-\",C$1),База!$A:$G,6,0))","v":"00:43:53.920"},3,{"$f":"IF(ISERROR(VLOOKUP(CONCATENATE($B25,\"-\",F$1),База!$A:$G,5,0)),IF(ISERROR(VLOOKUP(CONCATENATE($B25,\"-\",F$1),'База выдачи'!$A:$F,5,0)),\"\",VLOOKUP(CONCATENATE($B25,\"-\",F$1),'База выдачи'!$A:$F,5,0)),VLOOKUP(CONCATENATE($B25,\"-\",F$1),База!$A:$G,5,0))","v":"OK"},{"$f":"IF(ISERROR(VLOOKUP(CONCATENATE($B25,\"-\",F$1),База!$A:$G,6,0)),IF(ISERROR(VLOOKUP(CONCATENATE($B25,\"-\",F$1),'База выдачи'!$A:$F,6,0)),\"\",VLOOKUP(CONCATENATE($B25,\"-\",F$1),'База выдачи'!$A:$F,6,0)),VLOOKUP(CONCATENATE($B25,\"-\",F$1),База!$A:$G,6,0))","v":"01:05:28.660"},4,{"$f":"IF(ISERROR(VLOOKUP(CONCATENATE($B25,\"-\",I$1),База!$A:$G,5,0)),IF(ISERROR(VLOOKUP(CONCATENATE($B25,\"-\",I$1),'База выдачи'!$A:$F,5,0)),\"\",VLOOKUP(CONCATENATE($B25,\"-\",I$1),'База выдачи'!$A:$F,5,0)),VLOOKUP(CONCATENATE($B25,\"-\",I$1),База!$A:$G,5,0))","v":"OK"},{"$f":"IF(ISERROR(VLOOKUP(CONCATENATE($B25,\"-\",I$1),База!$A:$G,6,0)),IF(ISERROR(VLOOKUP(CONCATENATE($B25,\"-\",I$1),'База выдачи'!$A:$F,6,0)),\"\",VLOOKUP(CONCATENATE($B25,\"-\",I$1),'База выдачи'!$A:$F,6,0)),VLOOKUP(CONCATENATE($B25,\"-\",I$1),База!$A:$G,6,0))","v":"01:26:19.060"},7,{"$f":"IF(ISERROR(VLOOKUP(CONCATENATE($B25,\"-\",L$1),База!$A:$G,5,0)),IF(ISERROR(VLOOKUP(CONCATENATE($B25,\"-\",L$1),'База выдачи'!$A:$F,5,0)),\"\",VLOOKUP(CONCATENATE($B25,\"-\",L$1),'База выдачи'!$A:$F,5,0)),VLOOKUP(CONCATENATE($B25,\"-\",L$1),База!$A:$G,5,0))","v":"OK"},{"$f":"IF(ISERROR(VLOOKUP(CONCATENATE($B25,\"-\",L$1),База!$A:$G,6,0)),IF(ISERROR(VLOOKUP(CONCATENATE($B25,\"-\",L$1),'База выдачи'!$A:$F,6,0)),\"\",VLOOKUP(CONCATENATE($B25,\"-\",L$1),'База выдачи'!$A:$F,6,0)),VLOOKUP(CONCATENATE($B25,\"-\",L$1),База!$A:$G,6,0))","v":"01:39:57.210"},6,{"$f":"IF(ISERROR(VLOOKUP(CONCATENATE($B25,\"-\",O$1),База!$A:$G,5,0)),IF(ISERROR(VLOOKUP(CONCATENATE($B25,\"-\",O$1),'База выдачи'!$A:$F,5,0)),\"\",VLOOKUP(CONCATENATE($B25,\"-\",O$1),'База выдачи'!$A:$F,5,0)),VLOOKUP(CONCATENATE($B25,\"-\",O$1),База!$A:$G,5,0))","v":"XXXX"},{"$f":"IF(ISERROR(VLOOKUP(CONCATENATE($B25,\"-\",O$1),База!$A:$G,6,0)),IF(ISERROR(VLOOKUP(CONCATENATE($B25,\"-\",O$1),'База выдачи'!$A:$F,6,0)),\"\",VLOOKUP(CONCATENATE($B25,\"-\",O$1),'База выдачи'!$A:$F,6,0)),VLOOKUP(CONCATENATE($B25,\"-\",O$1),База!$A:$G,6,0))","v":"02:30:24.490"},8,{"$f":"IF(ISERROR(VLOOKUP(CONCATENATE($B25,\"-\",R$1),База!$A:$G,5,0)),IF(ISERROR(VLOOKUP(CONCATENATE($B25,\"-\",R$1),'База выдачи'!$A:$F,5,0)),\"\",VLOOKUP(CONCATENATE($B25,\"-\",R$1),'База выдачи'!$A:$F,5,0)),VLOOKUP(CONCATENATE($B25,\"-\",R$1),База!$A:$G,5,0))","v":"OK"},{"$f":"IF(ISERROR(VLOOKUP(CONCATENATE($B25,\"-\",R$1),База!$A:$G,6,0)),IF(ISERROR(VLOOKUP(CONCATENATE($B25,\"-\",R$1),'База выдачи'!$A:$F,6,0)),\"\",VLOOKUP(CONCATENATE($B25,\"-\",R$1),'База выдачи'!$A:$F,6,0)),VLOOKUP(CONCATENATE($B25,\"-\",R$1),База!$A:$G,6,0))","v":"02:49:49.140"},9,{"$f":"IF(ISERROR(VLOOKUP(CONCATENATE($B25,\"-\",U$1),База!$A:$G,5,0)),IF(ISERROR(VLOOKUP(CONCATENATE($B25,\"-\",U$1),'База выдачи'!$A:$F,5,0)),\"\",VLOOKUP(CONCATENATE($B25,\"-\",U$1),'База выдачи'!$A:$F,5,0)),VLOOKUP(CONCATENATE($B25,\"-\",U$1),База!$A:$G,5,0))","v":"ST"},{"$f":"IF(ISERROR(VLOOKUP(CONCATENATE($B25,\"-\",U$1),База!$A:$G,6,0)),IF(ISERROR(VLOOKUP(CONCATENATE($B25,\"-\",U$1),'База выдачи'!$A:$F,6,0)),\"\",VLOOKUP(CONCATENATE($B25,\"-\",U$1),'База выдачи'!$A:$F,6,0)),VLOOKUP(CONCATENATE($B25,\"-\",U$1),База!$A:$G,6,0))","v":"02:49:51.030"},1,{"$f":"IF(ISERROR(VLOOKUP(CONCATENATE($B25,\"-\",X$1),База!$A:$G,5,0)),IF(ISERROR(VLOOKUP(CONCATENATE($B25,\"-\",X$1),'База выдачи'!$A:$F,5,0)),\"\",VLOOKUP(CONCATENATE($B25,\"-\",X$1),'База выдачи'!$A:$F,5,0)),VLOOKUP(CONCATENATE($B25,\"-\",X$1),База!$A:$G,5,0))","v":""},{"$f":"IF(ISERROR(VLOOKUP(CONCATENATE($B25,\"-\",X$1),База!$A:$G,6,0)),IF(ISERROR(VLOOKUP(CONCATENATE($B25,\"-\",X$1),'База выдачи'!$A:$F,6,0)),\"\",VLOOKUP(CONCATENATE($B25,\"-\",X$1),'База выдачи'!$A:$F,6,0)),VLOOKUP(CONCATENATE($B25,\"-\",X$1),База!$A:$G,6,0))","v":""},2,{"$f":"IF(ISERROR(VLOOKUP(CONCATENATE($B25,\"-\",AA$1),База!$A:$G,5,0)),IF(ISERROR(VLOOKUP(CONCATENATE($B25,\"-\",AA$1),'База выдачи'!$A:$F,5,0)),\"\",VLOOKUP(CONCATENATE($B25,\"-\",AA$1),'База выдачи'!$A:$F,5,0)),VLOOKUP(CONCATENATE($B25,\"-\",AA$1),База!$A:$G,5,0))","v":""},{"$f":"IF(ISERROR(VLOOKUP(CONCATENATE($B25,\"-\",AA$1),База!$A:$G,6,0)),IF(ISERROR(VLOOKUP(CONCATENATE($B25,\"-\",AA$1),'База выдачи'!$A:$F,6,0)),\"\",VLOOKUP(CONCATENATE($B25,\"-\",AA$1),'База выдачи'!$A:$F,6,0)),VLOOKUP(CONCATENATE($B25,\"-\",AA$1),База!$A:$G,6,0))","v":""},"C",{"$f":"IF(ISERROR(VLOOKUP(CONCATENATE($B25,\"-\",AD$1),База!$A:$G,5,0)),IF(ISERROR(VLOOKUP(CONCATENATE($B25,\"-\",AD$1),'База выдачи'!$A:$F,5,0)),\"\",VLOOKUP(CONCATENATE($B25,\"-\",AD$1),'База выдачи'!$A:$F,5,0)),VLOOKUP(CONCATENATE($B25,\"-\",AD$1),База!$A:$G,5,0))","v":""},{"$f":"IF(ISERROR(VLOOKUP(CONCATENATE($B25,\"-\",AD$1),База!$A:$G,6,0)),IF(ISERROR(VLOOKUP(CONCATENATE($B25,\"-\",AD$1),'База выдачи'!$A:$F,6,0)),\"\",VLOOKUP(CONCATENATE($B25,\"-\",AD$1),'База выдачи'!$A:$F,6,0)),VLOOKUP(CONCATENATE($B25,\"-\",AD$1),База!$A:$G,6,0))","v":""},"D",{"$f":"IF(ISERROR(VLOOKUP(CONCATENATE($B25,\"-\",AG$1),База!$A:$G,5,0)),IF(ISERROR(VLOOKUP(CONCATENATE($B25,\"-\",AG$1),'База выдачи'!$A:$F,5,0)),\"\",VLOOKUP(CONCATENATE($B25,\"-\",AG$1),'База выдачи'!$A:$F,5,0)),VLOOKUP(CONCATENATE($B25,\"-\",AG$1),База!$A:$G,5,0))","v":""},{"$f":"IF(ISERROR(VLOOKUP(CONCATENATE($B25,\"-\",AG$1),База!$A:$G,6,0)),IF(ISERROR(VLOOKUP(CONCATENATE($B25,\"-\",AG$1),'База выдачи'!$A:$F,6,0)),\"\",VLOOKUP(CONCATENATE($B25,\"-\",AG$1),'База выдачи'!$A:$F,6,0)),VLOOKUP(CONCATENATE($B25,\"-\",AG$1),База!$A:$G,6,0))","v":""},"E",{"$f":"IF(ISERROR(VLOOKUP(CONCATENATE($B25,\"-\",AJ$1),База!$A:$G,5,0)),IF(ISERROR(VLOOKUP(CONCATENATE($B25,\"-\",AJ$1),'База выдачи'!$A:$F,5,0)),\"\",VLOOKUP(CONCATENATE($B25,\"-\",AJ$1),'База выдачи'!$A:$F,5,0)),VLOOKUP(CONCATENATE($B25,\"-\",AJ$1),База!$A:$G,5,0))","v":""},{"$f":"IF(ISERROR(VLOOKUP(CONCATENATE($B25,\"-\",AJ$1),База!$A:$G,6,0)),IF(ISERROR(VLOOKUP(CONCATENATE($B25,\"-\",AJ$1),'База выдачи'!$A:$F,6,0)),\"\",VLOOKUP(CONCATENATE($B25,\"-\",AJ$1),'База выдачи'!$A:$F,6,0)),VLOOKUP(CONCATENATE($B25,\"-\",AJ$1),База!$A:$G,6,0))","v":""},"F",{"$f":"IF(ISERROR(VLOOKUP(CONCATENATE($B25,\"-\",AM$1),База!$A:$G,5,0)),IF(ISERROR(VLOOKUP(CONCATENATE($B25,\"-\",AM$1),'База выдачи'!$A:$F,5,0)),\"\",VLOOKUP(CONCATENATE($B25,\"-\",AM$1),'База выдачи'!$A:$F,5,0)),VLOOKUP(CONCATENATE($B25,\"-\",AM$1),База!$A:$G,5,0))","v":""},{"$f":"IF(ISERROR(VLOOKUP(CONCATENATE($B25,\"-\",AM$1),База!$A:$G,6,0)),IF(ISERROR(VLOOKUP(CONCATENATE($B25,\"-\",AM$1),'База выдачи'!$A:$F,6,0)),\"\",VLOOKUP(CONCATENATE($B25,\"-\",AM$1),'База выдачи'!$A:$F,6,0)),VLOOKUP(CONCATENATE($B25,\"-\",AM$1),База!$A:$G,6,0))","v":""},"G",{"$f":"IF(ISERROR(VLOOKUP(CONCATENATE($B25,\"-\",AP$1),База!$A:$G,5,0)),IF(ISERROR(VLOOKUP(CONCATENATE($B25,\"-\",AP$1),'База выдачи'!$A:$F,5,0)),\"\",VLOOKUP(CONCATENATE($B25,\"-\",AP$1),'База выдачи'!$A:$F,5,0)),VLOOKUP(CONCATENATE($B25,\"-\",AP$1),База!$A:$G,5,0))","v":""},{"$f":"IF(ISERROR(VLOOKUP(CONCATENATE($B25,\"-\",AP$1),База!$A:$G,6,0)),IF(ISERROR(VLOOKUP(CONCATENATE($B25,\"-\",AP$1),'База выдачи'!$A:$F,6,0)),\"\",VLOOKUP(CONCATENATE($B25,\"-\",AP$1),'База выдачи'!$A:$F,6,0)),VLOOKUP(CONCATENATE($B25,\"-\",AP$1),База!$A:$G,6,0))","v":""},"H",{"$f":"IF(ISERROR(VLOOKUP(CONCATENATE($B25,\"-\",AS$1),База!$A:$G,5,0)),IF(ISERROR(VLOOKUP(CONCATENATE($B25,\"-\",AS$1),'База выдачи'!$A:$F,5,0)),\"\",VLOOKUP(CONCATENATE($B25,\"-\",AS$1),'База выдачи'!$A:$F,5,0)),VLOOKUP(CONCATENATE($B25,\"-\",AS$1),База!$A:$G,5,0))","v":""},{"$f":"IF(ISERROR(VLOOKUP(CONCATENATE($B25,\"-\",AS$1),База!$A:$G,6,0)),IF(ISERROR(VLOOKUP(CONCATENATE($B25,\"-\",AS$1),'База выдачи'!$A:$F,6,0)),\"\",VLOOKUP(CONCATENATE($B25,\"-\",AS$1),'База выдачи'!$A:$F,6,0)),VLOOKUP(CONCATENATE($B25,\"-\",AS$1),База!$A:$G,6,0))","v":""},null,null,{"$f":"COUNTIFS(База!B:B,Статистика!B25,База!E:E,\"OK\")","v":4},{"$f":"CY3","v":"02:49:49.140"},10189,{"$f":"COUNTIFS(База!B:B,Статистика!B25,База!E:E,\"XXXX\")","v":2},{"$f":"IF(AX25+AZ25+BA25=0,ксекундвигре-BD25,ксекундвигре*Статистика!AX25+(ксекундвигре-Статистика!AZ25)+Статистика!BA25)","v":44113},44810,23,29]
[24,{"$f":"IF(ISERROR(VLOOKUP(A26,Служебный!B:C,2,0)),\"\",A26&\"-\"&VLOOKUP(A26,Служебный!B:C,2,0))","v":"24-Антилопы ГНУ"},6,{"$f":"IF(ISERROR(VLOOKUP(CONCATENATE($B26,\"-\",C$1),База!$A:$G,5,0)),IF(ISERROR(VLOOKUP(CONCATENATE($B26,\"-\",C$1),'База выдачи'!$A:$F,5,0)),\"\",VLOOKUP(CONCATENATE($B26,\"-\",C$1),'База выдачи'!$A:$F,5,0)),VLOOKUP(CONCATENATE($B26,\"-\",C$1),База!$A:$G,5,0))","v":"XXXX"},{"$f":"IF(ISERROR(VLOOKUP(CONCATENATE($B26,\"-\",C$1),База!$A:$G,6,0)),IF(ISERROR(VLOOKUP(CONCATENATE($B26,\"-\",C$1),'База выдачи'!$A:$F,6,0)),\"\",VLOOKUP(CONCATENATE($B26,\"-\",C$1),'База выдачи'!$A:$F,6,0)),VLOOKUP(CONCATENATE($B26,\"-\",C$1),База!$A:$G,6,0))","v":"00:50:19.870"},9,{"$f":"IF(ISERROR(VLOOKUP(CONCATENATE($B26,\"-\",F$1),База!$A:$G,5,0)),IF(ISERROR(VLOOKUP(CONCATENATE($B26,\"-\",F$1),'База выдачи'!$A:$F,5,0)),\"\",VLOOKUP(CONCATENATE($B26,\"-\",F$1),'База выдачи'!$A:$F,5,0)),VLOOKUP(CONCATENATE($B26,\"-\",F$1),База!$A:$G,5,0))","v":"OK"},{"$f":"IF(ISERROR(VLOOKUP(CONCATENATE($B26,\"-\",F$1),База!$A:$G,6,0)),IF(ISERROR(VLOOKUP(CONCATENATE($B26,\"-\",F$1),'База выдачи'!$A:$F,6,0)),\"\",VLOOKUP(CONCATENATE($B26,\"-\",F$1),'База выдачи'!$A:$F,6,0)),VLOOKUP(CONCATENATE($B26,\"-\",F$1),База!$A:$G,6,0))","v":"01:02:53.640"},1,{"$f":"IF(ISERROR(VLOOKUP(CONCATENATE($B26,\"-\",I$1),База!$A:$G,5,0)),IF(ISERROR(VLOOKUP(CONCATENATE($B26,\"-\",I$1),'База выдачи'!$A:$F,5,0)),\"\",VLOOKUP(CONCATENATE($B26,\"-\",I$1),'База выдачи'!$A:$F,5,0)),VLOOKUP(CONCATENATE($B26,\"-\",I$1),База!$A:$G,5,0))","v":"XXXX"},{"$f":"IF(ISERROR(VLOOKUP(CONCATENATE($B26,\"-\",I$1),База!$A:$G,6,0)),IF(ISERROR(VLOOKUP(CONCATENATE($B26,\"-\",I$1),'База выдачи'!$A:$F,6,0)),\"\",VLOOKUP(CONCATENATE($B26,\"-\",I$1),'База выдачи'!$A:$F,6,0)),VLOOKUP(CONCATENATE($B26,\"-\",I$1),База!$A:$G,6,0))","v":"01:39:25.550"},2,{"$f":"IF(ISERROR(VLOOKUP(CONCATENATE($B26,\"-\",L$1),База!$A:$G,5,0)),IF(ISERROR(VLOOKUP(CONCATENATE($B26,\"-\",L$1),'База выдачи'!$A:$F,5,0)),\"\",VLOOKUP(CONCATENATE($B26,\"-\",L$1),'База выдачи'!$A:$F,5,0)),VLOOKUP(CONCATENATE($B26,\"-\",L$1),База!$A:$G,5,0))","v":"OK"},{"$f":"IF(ISERROR(VLOOKUP(CONCATENATE($B26,\"-\",L$1),База!$A:$G,6,0)),IF(ISERROR(VLOOKUP(CONCATENATE($B26,\"-\",L$1),'База выдачи'!$A:$F,6,0)),\"\",VLOOKUP(CONCATENATE($B26,\"-\",L$1),'База выдачи'!$A:$F,6,0)),VLOOKUP(CONCATENATE($B26,\"-\",L$1),База!$A:$G,6,0))","v":"01:59:54.710"},7,{"$f":"IF(ISERROR(VLOOKUP(CONCATENATE($B26,\"-\",O$1),База!$A:$G,5,0)),IF(ISERROR(VLOOKUP(CONCATENATE($B26,\"-\",O$1),'База выдачи'!$A:$F,5,0)),\"\",VLOOKUP(CONCATENATE($B26,\"-\",O$1),'База выдачи'!$A:$F,5,0)),VLOOKUP(CONCATENATE($B26,\"-\",O$1),База!$A:$G,5,0))","v":"OK"},{"$f":"IF(ISERROR(VLOOKUP(CONCATENATE($B26,\"-\",O$1),База!$A:$G,6,0)),IF(ISERROR(VLOOKUP(CONCATENATE($B26,\"-\",O$1),'База выдачи'!$A:$F,6,0)),\"\",VLOOKUP(CONCATENATE($B26,\"-\",O$1),'База выдачи'!$A:$F,6,0)),VLOOKUP(CONCATENATE($B26,\"-\",O$1),База!$A:$G,6,0))","v":"02:17:27.830"},5,{"$f":"IF(ISERROR(VLOOKUP(CONCATENATE($B26,\"-\",R$1),База!$A:$G,5,0)),IF(ISERROR(VLOOKUP(CONCATENATE($B26,\"-\",R$1),'База выдачи'!$A:$F,5,0)),\"\",VLOOKUP(CONCATENATE($B26,\"-\",R$1),'База выдачи'!$A:$F,5,0)),VLOOKUP(CONCATENATE($B26,\"-\",R$1),База!$A:$G,5,0))","v":"OK"},{"$f":"IF(ISERROR(VLOOKUP(CONCATENATE($B26,\"-\",R$1),База!$A:$G,6,0)),IF(ISERROR(VLOOKUP(CONCATENATE($B26,\"-\",R$1),'База выдачи'!$A:$F,6,0)),\"\",VLOOKUP(CONCATENATE($B26,\"-\",R$1),'База выдачи'!$A:$F,6,0)),VLOOKUP(CONCATENATE($B26,\"-\",R$1),База!$A:$G,6,0))","v":"02:31:36.910"},8,{"$f":"IF(ISERROR(VLOOKUP(CONCATENATE($B26,\"-\",U$1),База!$A:$G,5,0)),IF(ISERROR(VLOOKUP(CONCATENATE($B26,\"-\",U$1),'База выдачи'!$A:$F,5,0)),\"\",VLOOKUP(CONCATENATE($B26,\"-\",U$1),'База выдачи'!$A:$F,5,0)),VLOOKUP(CONCATENATE($B26,\"-\",U$1),База!$A:$G,5,0))","v":"OK"},{"$f":"IF(ISERROR(VLOOKUP(CONCATENATE($B26,\"-\",U$1),База!$A:$G,6,0)),IF(ISERROR(VLOOKUP(CONCATENATE($B26,\"-\",U$1),'База выдачи'!$A:$F,6,0)),\"\",VLOOKUP(CONCATENATE($B26,\"-\",U$1),'База выдачи'!$A:$F,6,0)),VLOOKUP(CONCATENATE($B26,\"-\",U$1),База!$A:$G,6,0))","v":"02:53:29.070"},4,{"$f":"IF(ISERROR(VLOOKUP(CONCATENATE($B26,\"-\",X$1),База!$A:$G,5,0)),IF(ISERROR(VLOOKUP(CONCATENATE($B26,\"-\",X$1),'База выдачи'!$A:$F,5,0)),\"\",VLOOKUP(CONCATENATE($B26,\"-\",X$1),'База выдачи'!$A:$F,5,0)),VLOOKUP(CONCATENATE($B26,\"-\",X$1),База!$A:$G,5,0))","v":"ST"},{"$f":"IF(ISERROR(VLOOKUP(CONCATENATE($B26,\"-\",X$1),База!$A:$G,6,0)),IF(ISERROR(VLOOKUP(CONCATENATE($B26,\"-\",X$1),'База выдачи'!$A:$F,6,0)),\"\",VLOOKUP(CONCATENATE($B26,\"-\",X$1),'База выдачи'!$A:$F,6,0)),VLOOKUP(CONCATENATE($B26,\"-\",X$1),База!$A:$G,6,0))","v":"02:53:30.990"},3,{"$f":"IF(ISERROR(VLOOKUP(CONCATENATE($B26,\"-\",AA$1),База!$A:$G,5,0)),IF(ISERROR(VLOOKUP(CONCATENATE($B26,\"-\",AA$1),'База выдачи'!$A:$F,5,0)),\"\",VLOOKUP(CONCATENATE($B26,\"-\",AA$1),'База выдачи'!$A:$F,5,0)),VLOOKUP(CONCATENATE($B26,\"-\",AA$1),База!$A:$G,5,0))","v":""},{"$f":"IF(ISERROR(VLOOKUP(CONCATENATE($B26,\"-\",AA$1),База!$A:$G,6,0)),IF(ISERROR(VLOOKUP(CONCATENATE($B26,\"-\",AA$1),'База выдачи'!$A:$F,6,0)),\"\",VLOOKUP(CONCATENATE($B26,\"-\",AA$1),'База выдачи'!$A:$F,6,0)),VLOOKUP(CONCATENATE($B26,\"-\",AA$1),База!$A:$G,6,0))","v":""},"B",{"$f":"IF(ISERROR(VLOOKUP(CONCATENATE($B26,\"-\",AD$1),База!$A:$G,5,0)),IF(ISERROR(VLOOKUP(CONCATENATE($B26,\"-\",AD$1),'База выдачи'!$A:$F,5,0)),\"\",VLOOKUP(CONCATENATE($B26,\"-\",AD$1),'База выдачи'!$A:$F,5,0)),VLOOKUP(CONCATENATE($B26,\"-\",AD$1),База!$A:$G,5,0))","v":""},{"$f":"IF(ISERROR(VLOOKUP(CONCATENATE($B26,\"-\",AD$1),База!$A:$G,6,0)),IF(ISERROR(VLOOKUP(CONCATENATE($B26,\"-\",AD$1),'База выдачи'!$A:$F,6,0)),\"\",VLOOKUP(CONCATENATE($B26,\"-\",AD$1),'База выдачи'!$A:$F,6,0)),VLOOKUP(CONCATENATE($B26,\"-\",AD$1),База!$A:$G,6,0))","v":""},"C",{"$f":"IF(ISERROR(VLOOKUP(CONCATENATE($B26,\"-\",AG$1),База!$A:$G,5,0)),IF(ISERROR(VLOOKUP(CONCATENATE($B26,\"-\",AG$1),'База выдачи'!$A:$F,5,0)),\"\",VLOOKUP(CONCATENATE($B26,\"-\",AG$1),'База выдачи'!$A:$F,5,0)),VLOOKUP(CONCATENATE($B26,\"-\",AG$1),База!$A:$G,5,0))","v":""},{"$f":"IF(ISERROR(VLOOKUP(CONCATENATE($B26,\"-\",AG$1),База!$A:$G,6,0)),IF(ISERROR(VLOOKUP(CONCATENATE($B26,\"-\",AG$1),'База выдачи'!$A:$F,6,0)),\"\",VLOOKUP(CONCATENATE($B26,\"-\",AG$1),'База выдачи'!$A:$F,6,0)),VLOOKUP(CONCATENATE($B26,\"-\",AG$1),База!$A:$G,6,0))","v":""},"D",{"$f":"IF(ISERROR(VLOOKUP(CONCATENATE($B26,\"-\",AJ$1),База!$A:$G,5,0)),IF(ISERROR(VLOOKUP(CONCATENATE($B26,\"-\",AJ$1),'База выдачи'!$A:$F,5,0)),\"\",VLOOKUP(CONCATENATE($B26,\"-\",AJ$1),'База выдачи'!$A:$F,5,0)),VLOOKUP(CONCATENATE($B26,\"-\",AJ$1),База!$A:$G,5,0))","v":""},{"$f":"IF(ISERROR(VLOOKUP(CONCATENATE($B26,\"-\",AJ$1),База!$A:$G,6,0)),IF(ISERROR(VLOOKUP(CONCATENATE($B26,\"-\",AJ$1),'База выдачи'!$A:$F,6,0)),\"\",VLOOKUP(CONCATENATE($B26,\"-\",AJ$1),'База выдачи'!$A:$F,6,0)),VLOOKUP(CONCATENATE($B26,\"-\",AJ$1),База!$A:$G,6,0))","v":""},"E",{"$f":"IF(ISERROR(VLOOKUP(CONCATENATE($B26,\"-\",AM$1),База!$A:$G,5,0)),IF(ISERROR(VLOOKUP(CONCATENATE($B26,\"-\",AM$1),'База выдачи'!$A:$F,5,0)),\"\",VLOOKUP(CONCATENATE($B26,\"-\",AM$1),'База выдачи'!$A:$F,5,0)),VLOOKUP(CONCATENATE($B26,\"-\",AM$1),База!$A:$G,5,0))","v":""},{"$f":"IF(ISERROR(VLOOKUP(CONCATENATE($B26,\"-\",AM$1),База!$A:$G,6,0)),IF(ISERROR(VLOOKUP(CONCATENATE($B26,\"-\",AM$1),'База выдачи'!$A:$F,6,0)),\"\",VLOOKUP(CONCATENATE($B26,\"-\",AM$1),'База выдачи'!$A:$F,6,0)),VLOOKUP(CONCATENATE($B26,\"-\",AM$1),База!$A:$G,6,0))","v":""},"F",{"$f":"IF(ISERROR(VLOOKUP(CONCATENATE($B26,\"-\",AP$1),База!$A:$G,5,0)),IF(ISERROR(VLOOKUP(CONCATENATE($B26,\"-\",AP$1),'База выдачи'!$A:$F,5,0)),\"\",VLOOKUP(CONCATENATE($B26,\"-\",AP$1),'База выдачи'!$A:$F,5,0)),VLOOKUP(CONCATENATE($B26,\"-\",AP$1),База!$A:$G,5,0))","v":""},{"$f":"IF(ISERROR(VLOOKUP(CONCATENATE($B26,\"-\",AP$1),База!$A:$G,6,0)),IF(ISERROR(VLOOKUP(CONCATENATE($B26,\"-\",AP$1),'База выдачи'!$A:$F,6,0)),\"\",VLOOKUP(CONCATENATE($B26,\"-\",AP$1),'База выдачи'!$A:$F,6,0)),VLOOKUP(CONCATENATE($B26,\"-\",AP$1),База!$A:$G,6,0))","v":""},"G",{"$f":"IF(ISERROR(VLOOKUP(CONCATENATE($B26,\"-\",AS$1),База!$A:$G,5,0)),IF(ISERROR(VLOOKUP(CONCATENATE($B26,\"-\",AS$1),'База выдачи'!$A:$F,5,0)),\"\",VLOOKUP(CONCATENATE($B26,\"-\",AS$1),'База выдачи'!$A:$F,5,0)),VLOOKUP(CONCATENATE($B26,\"-\",AS$1),База!$A:$G,5,0))","v":""},{"$f":"IF(ISERROR(VLOOKUP(CONCATENATE($B26,\"-\",AS$1),База!$A:$G,6,0)),IF(ISERROR(VLOOKUP(CONCATENATE($B26,\"-\",AS$1),'База выдачи'!$A:$F,6,0)),\"\",VLOOKUP(CONCATENATE($B26,\"-\",AS$1),'База выдачи'!$A:$F,6,0)),VLOOKUP(CONCATENATE($B26,\"-\",AS$1),База!$A:$G,6,0))","v":""},null,null,{"$f":"COUNTIFS(База!B:B,Статистика!B26,База!E:E,\"OK\")","v":5},{"$f":"DA3","v":"02:53:29.070"},10409,{"$f":"COUNTIFS(База!B:B,Статистика!B26,База!E:E,\"XXXX\")","v":2},{"$f":"IF(AX26+AZ26+BA26=0,ксекундвигре-BD26,ксекундвигре*Статистика!AX26+(ксекундвигре-Статистика!AZ26)+Статистика!BA26)","v":54753},44702,24,20]
[25,{"$f":"IF(ISERROR(VLOOKUP(A27,Служебный!B:C,2,0)),\"\",A27&\"-\"&VLOOKUP(A27,Служебный!B:C,2,0))","v":"25-Черный плащ"},7,{"$f":"IF(ISERROR(VLOOKUP(CONCATENATE($B27,\"-\",C$1),База!$A:$G,5,0)),IF(ISERROR(VLOOKUP(CONCATENATE($B27,\"-\",C$1),'База выдачи'!$A:$F,5,0)),\"\",VLOOKUP(CONCATENATE($B27,\"-\",C$1),'База выдачи'!$A:$F,5,0)),VLOOKUP(CONCATENATE($B27,\"-\",C$1),База!$A:$G,5,0))","v":"OK"},{"$f":"IF(ISERROR(VLOOKUP(CONCATENATE($B27,\"-\",C$1),База!$A:$G,6,0)),IF(ISERROR(VLOOKUP(CONCATENATE($B27,\"-\",C$1),'База выдачи'!$A:$F,6,0)),\"\",VLOOKUP(CONCATENATE($B27,\"-\",C$1),'База выдачи'!$A:$F,6,0)),VLOOKUP(CONCATENATE($B27,\"-\",C$1),База!$A:$G,6,0))","v":"00:26:00.240"},2,{"$f":"IF(ISERROR(VLOOKUP(CONCATENATE($B27,\"-\",F$1),База!$A:$G,5,0)),IF(ISERROR(VLOOKUP(CONCATENATE($B27,\"-\",F$1),'База выдачи'!$A:$F,5,0)),\"\",VLOOKUP(CONCATENATE($B27,\"-\",F$1),'База выдачи'!$A:$F,5,0)),VLOOKUP(CONCATENATE($B27,\"-\",F$1),База!$A:$G,5,0))","v":"OK"},{"$f":"IF(ISERROR(VLOOKUP(CONCATENATE($B27,\"-\",F$1),База!$A:$G,6,0)),IF(ISERROR(VLOOKUP(CONCATENATE($B27,\"-\",F$1),'База выдачи'!$A:$F,6,0)),\"\",VLOOKUP(CONCATENATE($B27,\"-\",F$1),'База выдачи'!$A:$F,6,0)),VLOOKUP(CONCATENATE($B27,\"-\",F$1),База!$A:$G,6,0))","v":"00:56:17.470"},6,{"$f":"IF(ISERROR(VLOOKUP(CONCATENATE($B27,\"-\",I$1),База!$A:$G,5,0)),IF(ISERROR(VLOOKUP(CONCATENATE($B27,\"-\",I$1),'База выдачи'!$A:$F,5,0)),\"\",VLOOKUP(CONCATENATE($B27,\"-\",I$1),'База выдачи'!$A:$F,5,0)),VLOOKUP(CONCATENATE($B27,\"-\",I$1),База!$A:$G,5,0))","v":"OK"},{"$f":"IF(ISERROR(VLOOKUP(CONCATENATE($B27,\"-\",I$1),База!$A:$G,6,0)),IF(ISERROR(VLOOKUP(CONCATENATE($B27,\"-\",I$1),'База выдачи'!$A:$F,6,0)),\"\",VLOOKUP(CONCATENATE($B27,\"-\",I$1),'База выдачи'!$A:$F,6,0)),VLOOKUP(CONCATENATE($B27,\"-\",I$1),База!$A:$G,6,0))","v":"01:20:38.300"},5,{"$f":"IF(ISERROR(VLOOKUP(CONCATENATE($B27,\"-\",L$1),База!$A:$G,5,0)),IF(ISERROR(VLOOKUP(CONCATENATE($B27,\"-\",L$1),'База выдачи'!$A:$F,5,0)),\"\",VLOOKUP(CONCATENATE($B27,\"-\",L$1),'База выдачи'!$A:$F,5,0)),VLOOKUP(CONCATENATE($B27,\"-\",L$1),База!$A:$G,5,0))","v":"OK"},{"$f":"IF(ISERROR(VLOOKUP(CONCATENATE($B27,\"-\",L$1),База!$A:$G,6,0)),IF(ISERROR(VLOOKUP(CONCATENATE($B27,\"-\",L$1),'База выдачи'!$A:$F,6,0)),\"\",VLOOKUP(CONCATENATE($B27,\"-\",L$1),'База выдачи'!$A:$F,6,0)),VLOOKUP(CONCATENATE($B27,\"-\",L$1),База!$A:$G,6,0))","v":"01:49:29.100"},3,{"$f":"IF(ISERROR(VLOOKUP(CONCATENATE($B27,\"-\",O$1),База!$A:$G,5,0)),IF(ISERROR(VLOOKUP(CONCATENATE($B27,\"-\",O$1),'База выдачи'!$A:$F,5,0)),\"\",VLOOKUP(CONCATENATE($B27,\"-\",O$1),'База выдачи'!$A:$F,5,0)),VLOOKUP(CONCATENATE($B27,\"-\",O$1),База!$A:$G,5,0))","v":"OK"},{"$f":"IF(ISERROR(VLOOKUP(CONCATENATE($B27,\"-\",O$1),База!$A:$G,6,0)),IF(ISERROR(VLOOKUP(CONCATENATE($B27,\"-\",O$1),'База выдачи'!$A:$F,6,0)),\"\",VLOOKUP(CONCATENATE($B27,\"-\",O$1),'База выдачи'!$A:$F,6,0)),VLOOKUP(CONCATENATE($B27,\"-\",O$1),База!$A:$G,6,0))","v":"02:09:50.740"},9,{"$f":"IF(ISERROR(VLOOKUP(CONCATENATE($B27,\"-\",R$1),База!$A:$G,5,0)),IF(ISERROR(VLOOKUP(CONCATENATE($B27,\"-\",R$1),'База выдачи'!$A:$F,5,0)),\"\",VLOOKUP(CONCATENATE($B27,\"-\",R$1),'База выдачи'!$A:$F,5,0)),VLOOKUP(CONCATENATE($B27,\"-\",R$1),База!$A:$G,5,0))","v":"OK"},{"$f":"IF(ISERROR(VLOOKUP(CONCATENATE($B27,\"-\",R$1),База!$A:$G,6,0)),IF(ISERROR(VLOOKUP(CONCATENATE($B27,\"-\",R$1),'База выдачи'!$A:$F,6,0)),\"\",VLOOKUP(CONCATENATE($B27,\"-\",R$1),'База выдачи'!$A:$F,6,0)),VLOOKUP(CONCATENATE($B27,\"-\",R$1),База!$A:$G,6,0))","v":"02:55:25.040"},1,{"$f":"IF(ISERROR(VLOOKUP(CONCATENATE($B27,\"-\",U$1),База!$A:$G,5,0)),IF(ISERROR(VLOOKUP(CONCATENATE($B27,\"-\",U$1),'База выдачи'!$A:$F,5,0)),\"\",VLOOKUP(CONCATENATE($B27,\"-\",U$1),'База выдачи'!$A:$F,5,0)),VLOOKUP(CONCATENATE($B27,\"-\",U$1),База!$A:$G,5,0))","v":"ST"},{"$f":"IF(ISERROR(VLOOKUP(CONCATENATE($B27,\"-\",U$1),База!$A:$G,6,0)),IF(ISERROR(VLOOKUP(CONCATENATE($B27,\"-\",U$1),'База выдачи'!$A:$F,6,0)),\"\",VLOOKUP(CONCATENATE($B27,\"-\",U$1),'База выдачи'!$A:$F,6,0)),VLOOKUP(CONCATENATE($B27,\"-\",U$1),База!$A:$G,6,0))","v":"02:55:26.950"},8,{"$f":"IF(ISERROR(VLOOKUP(CONCATENATE($B27,\"-\",X$1),База!$A:$G,5,0)),IF(ISERROR(VLOOKUP(CONCATENATE($B27,\"-\",X$1),'База выдачи'!$A:$F,5,0)),\"\",VLOOKUP(CONCATENATE($B27,\"-\",X$1),'База выдачи'!$A:$F,5,0)),VLOOKUP(CONCATENATE($B27,\"-\",X$1),База!$A:$G,5,0))","v":""},{"$f":"IF(ISERROR(VLOOKUP(CONCATENATE($B27,\"-\",X$1),База!$A:$G,6,0)),IF(ISERROR(VLOOKUP(CONCATENATE($B27,\"-\",X$1),'База выдачи'!$A:$F,6,0)),\"\",VLOOKUP(CONCATENATE($B27,\"-\",X$1),'База выдачи'!$A:$F,6,0)),VLOOKUP(CONCATENATE($B27,\"-\",X$1),База!$A:$G,6,0))","v":""},4,{"$f":"IF(ISERROR(VLOOKUP(CONCATENATE($B27,\"-\",AA$1),База!$A:$G,5,0)),IF(ISERROR(VLOOKUP(CONCATENATE($B27,\"-\",AA$1),'База выдачи'!$A:$F,5,0)),\"\",VLOOKUP(CONCATENATE($B27,\"-\",AA$1),'База выдачи'!$A:$F,5,0)),VLOOKUP(CONCATENATE($B27,\"-\",AA$1),База!$A:$G,5,0))","v":""},{"$f":"IF(ISERROR(VLOOKUP(CONCATENATE($B27,\"-\",AA$1),База!$A:$G,6,0)),IF(ISERROR(VLOOKUP(CONCATENATE($B27,\"-\",AA$1),'База выдачи'!$A:$F,6,0)),\"\",VLOOKUP(CONCATENATE($B27,\"-\",AA$1),'База выдачи'!$A:$F,6,0)),VLOOKUP(CONCATENATE($B27,\"-\",AA$1),База!$A:$G,6,0))","v":""},"A",{"$f":"IF(ISERROR(VLOOKUP(CONCATENATE($B27,\"-\",AD$1),База!$A:$G,5,0)),IF(ISERROR(VLOOKUP(CONCATENATE($B27,\"-\",AD$1),'База выдачи'!$A:$F,5,0)),\"\",VLOOKUP(CONCATENATE($B27,\"-\",AD$1),'База выдачи'!$A:$F,5,0)),VLOOKUP(CONCATENATE($B27,\"-\",AD$1),База!$A:$G,5,0))","v":""},{"$f":"IF(ISERROR(VLOOKUP(CONCATENATE($B27,\"-\",AD$1),База!$A:$G,6,0)),IF(ISERROR(VLOOKUP(CONCATENATE($B27,\"-\",AD$1),'База выдачи'!$A:$F,6,0)),\"\",VLOOKUP(CONCATENATE($B27,\"-\",AD$1),'База выдачи'!$A:$F,6,0)),VLOOKUP(CONCATENATE($B27,\"-\",AD$1),База!$A:$G,6,0))","v":""},"B",{"$f":"IF(ISERROR(VLOOKUP(CONCATENATE($B27,\"-\",AG$1),База!$A:$G,5,0)),IF(ISERROR(VLOOKUP(CONCATENATE($B27,\"-\",AG$1),'База выдачи'!$A:$F,5,0)),\"\",VLOOKUP(CONCATENATE($B27,\"-\",AG$1),'База выдачи'!$A:$F,5,0)),VLOOKUP(CONCATENATE($B27,\"-\",AG$1),База!$A:$G,5,0))","v":""},{"$f":"IF(ISERROR(VLOOKUP(CONCATENATE($B27,\"-\",AG$1),База!$A:$G,6,0)),IF(ISERROR(VLOOKUP(CONCATENATE($B27,\"-\",AG$1),'База выдачи'!$A:$F,6,0)),\"\",VLOOKUP(CONCATENATE($B27,\"-\",AG$1),'База выдачи'!$A:$F,6,0)),VLOOKUP(CONCATENATE($B27,\"-\",AG$1),База!$A:$G,6,0))","v":""},"C",{"$f":"IF(ISERROR(VLOOKUP(CONCATENATE($B27,\"-\",AJ$1),База!$A:$G,5,0)),IF(ISERROR(VLOOKUP(CONCATENATE($B27,\"-\",AJ$1),'База выдачи'!$A:$F,5,0)),\"\",VLOOKUP(CONCATENATE($B27,\"-\",AJ$1),'База выдачи'!$A:$F,5,0)),VLOOKUP(CONCATENATE($B27,\"-\",AJ$1),База!$A:$G,5,0))","v":""},{"$f":"IF(ISERROR(VLOOKUP(CONCATENATE($B27,\"-\",AJ$1),База!$A:$G,6,0)),IF(ISERROR(VLOOKUP(CONCATENATE($B27,\"-\",AJ$1),'База выдачи'!$A:$F,6,0)),\"\",VLOOKUP(CONCATENATE($B27,\"-\",AJ$1),'База выдачи'!$A:$F,6,0)),VLOOKUP(CONCATENATE($B27,\"-\",AJ$1),База!$A:$G,6,0))","v":""},"D",{"$f":"IF(ISERROR(VLOOKUP(CONCATENATE($B27,\"-\",AM$1),База!$A:$G,5,0)),IF(ISERROR(VLOOKUP(CONCATENATE($B27,\"-\",AM$1),'База выдачи'!$A:$F,5,0)),\"\",VLOOKUP(CONCATENATE($B27,\"-\",AM$1),'База выдачи'!$A:$F,5,0)),VLOOKUP(CONCATENATE($B27,\"-\",AM$1),База!$A:$G,5,0))","v":""},{"$f":"IF(ISERROR(VLOOKUP(CONCATENATE($B27,\"-\",AM$1),База!$A:$G,6,0)),IF(ISERROR(VLOOKUP(CONCATENATE($B27,\"-\",AM$1),'База выдачи'!$A:$F,6,0)),\"\",VLOOKUP(CONCATENATE($B27,\"-\",AM$1),'База выдачи'!$A:$F,6,0)),VLOOKUP(CONCATENATE($B27,\"-\",AM$1),База!$A:$G,6,0))","v":""},"E",{"$f":"IF(ISERROR(VLOOKUP(CONCATENATE($B27,\"-\",AP$1),База!$A:$G,5,0)),IF(ISERROR(VLOOKUP(CONCATENATE($B27,\"-\",AP$1),'База выдачи'!$A:$F,5,0)),\"\",VLOOKUP(CONCATENATE($B27,\"-\",AP$1),'База выдачи'!$A:$F,5,0)),VLOOKUP(CONCATENATE($B27,\"-\",AP$1),База!$A:$G,5,0))","v":""},{"$f":"IF(ISERROR(VLOOKUP(CONCATENATE($B27,\"-\",AP$1),База!$A:$G,6,0)),IF(ISERROR(VLOOKUP(CONCATENATE($B27,\"-\",AP$1),'База выдачи'!$A:$F,6,0)),\"\",VLOOKUP(CONCATENATE($B27,\"-\",AP$1),'База выдачи'!$A:$F,6,0)),VLOOKUP(CONCATENATE($B27,\"-\",AP$1),База!$A:$G,6,0))","v":""},"F",{"$f":"IF(ISERROR(VLOOKUP(CONCATENATE($B27,\"-\",AS$1),База!$A:$G,5,0)),IF(ISERROR(VLOOKUP(CONCATENATE($B27,\"-\",AS$1),'База выдачи'!$A:$F,5,0)),\"\",VLOOKUP(CONCATENATE($B27,\"-\",AS$1),'База выдачи'!$A:$F,5,0)),VLOOKUP(CONCATENATE($B27,\"-\",AS$1),База!$A:$G,5,0))","v":""},{"$f":"IF(ISERROR(VLOOKUP(CONCATENATE($B27,\"-\",AS$1),База!$A:$G,6,0)),IF(ISERROR(VLOOKUP(CONCATENATE($B27,\"-\",AS$1),'База выдачи'!$A:$F,6,0)),\"\",VLOOKUP(CONCATENATE($B27,\"-\",AS$1),'База выдачи'!$A:$F,6,0)),VLOOKUP(CONCATENATE($B27,\"-\",AS$1),База!$A:$G,6,0))","v":""},null,null,{"$f":"COUNTIFS(База!B:B,Статистика!B27,База!E:E,\"OK\")","v":6},{"$f":"DC3","v":"02:55:25.040"},10525,{"$f":"COUNTIFS(База!B:B,Статистика!B27,База!E:E,\"XXXX\")","v":0},{"$f":"IF(AX27+AZ27+BA27=0,ксекундвигре-BD27,ксекундвигре*Статистика!AX27+(ксекундвигре-Статистика!AZ27)+Статистика!BA27)","v":65495},44113,25,23]
[26,{"$f":"IF(ISERROR(VLOOKUP(A28,Служебный!B:C,2,0)),\"\",A28&\"-\"&VLOOKUP(A28,Служебный!B:C,2,0))","v":"26-НеоБастардс"},8,{"$f":"IF(ISERROR(VLOOKUP(CONCATENATE($B28,\"-\",C$1),База!$A:$G,5,0)),IF(ISERROR(VLOOKUP(CONCATENATE($B28,\"-\",C$1),'База выдачи'!$A:$F,5,0)),\"\",VLOOKUP(CONCATENATE($B28,\"-\",C$1),'База выдачи'!$A:$F,5,0)),VLOOKUP(CONCATENATE($B28,\"-\",C$1),База!$A:$G,5,0))","v":"OK"},{"$f":"IF(ISERROR(VLOOKUP(CONCATENATE($B28,\"-\",C$1),База!$A:$G,6,0)),IF(ISERROR(VLOOKUP(CONCATENATE($B28,\"-\",C$1),'База выдачи'!$A:$F,6,0)),\"\",VLOOKUP(CONCATENATE($B28,\"-\",C$1),'База выдачи'!$A:$F,6,0)),VLOOKUP(CONCATENATE($B28,\"-\",C$1),База!$A:$G,6,0))","v":"00:27:58.940"},4,{"$f":"IF(ISERROR(VLOOKUP(CONCATENATE($B28,\"-\",F$1),База!$A:$G,5,0)),IF(ISERROR(VLOOKUP(CONCATENATE($B28,\"-\",F$1),'База выдачи'!$A:$F,5,0)),\"\",VLOOKUP(CONCATENATE($B28,\"-\",F$1),'База выдачи'!$A:$F,5,0)),VLOOKUP(CONCATENATE($B28,\"-\",F$1),База!$A:$G,5,0))","v":"OK"},{"$f":"IF(ISERROR(VLOOKUP(CONCATENATE($B28,\"-\",F$1),База!$A:$G,6,0)),IF(ISERROR(VLOOKUP(CONCATENATE($B28,\"-\",F$1),'База выдачи'!$A:$F,6,0)),\"\",VLOOKUP(CONCATENATE($B28,\"-\",F$1),'База выдачи'!$A:$F,6,0)),VLOOKUP(CONCATENATE($B28,\"-\",F$1),База!$A:$G,6,0))","v":"00:45:49.130"},9,{"$f":"IF(ISERROR(VLOOKUP(CONCATENATE($B28,\"-\",I$1),База!$A:$G,5,0)),IF(ISERROR(VLOOKUP(CONCATENATE($B28,\"-\",I$1),'База выдачи'!$A:$F,5,0)),\"\",VLOOKUP(CONCATENATE($B28,\"-\",I$1),'База выдачи'!$A:$F,5,0)),VLOOKUP(CONCATENATE($B28,\"-\",I$1),База!$A:$G,5,0))","v":"OK"},{"$f":"IF(ISERROR(VLOOKUP(CONCATENATE($B28,\"-\",I$1),База!$A:$G,6,0)),IF(ISERROR(VLOOKUP(CONCATENATE($B28,\"-\",I$1),'База выдачи'!$A:$F,6,0)),\"\",VLOOKUP(CONCATENATE($B28,\"-\",I$1),'База выдачи'!$A:$F,6,0)),VLOOKUP(CONCATENATE($B28,\"-\",I$1),База!$A:$G,6,0))","v":"01:06:53.490"},6,{"$f":"IF(ISERROR(VLOOKUP(CONCATENATE($B28,\"-\",L$1),База!$A:$G,5,0)),IF(ISERROR(VLOOKUP(CONCATENATE($B28,\"-\",L$1),'База выдачи'!$A:$F,5,0)),\"\",VLOOKUP(CONCATENATE($B28,\"-\",L$1),'База выдачи'!$A:$F,5,0)),VLOOKUP(CONCATENATE($B28,\"-\",L$1),База!$A:$G,5,0))","v":"OK"},{"$f":"IF(ISERROR(VLOOKUP(CONCATENATE($B28,\"-\",L$1),База!$A:$G,6,0)),IF(ISERROR(VLOOKUP(CONCATENATE($B28,\"-\",L$1),'База выдачи'!$A:$F,6,0)),\"\",VLOOKUP(CONCATENATE($B28,\"-\",L$1),'База выдачи'!$A:$F,6,0)),VLOOKUP(CONCATENATE($B28,\"-\",L$1),База!$A:$G,6,0))","v":"01:20:27.670"},5,{"$f":"IF(ISERROR(VLOOKUP(CONCATENATE($B28,\"-\",O$1),База!$A:$G,5,0)),IF(ISERROR(VLOOKUP(CONCATENATE($B28,\"-\",O$1),'База выдачи'!$A:$F,5,0)),\"\",VLOOKUP(CONCATENATE($B28,\"-\",O$1),'База выдачи'!$A:$F,5,0)),VLOOKUP(CONCATENATE($B28,\"-\",O$1),База!$A:$G,5,0))","v":"OK"},{"$f":"IF(ISERROR(VLOOKUP(CONCATENATE($B28,\"-\",O$1),База!$A:$G,6,0)),IF(ISERROR(VLOOKUP(CONCATENATE($B28,\"-\",O$1),'База выдачи'!$A:$F,6,0)),\"\",VLOOKUP(CONCATENATE($B28,\"-\",O$1),'База выдачи'!$A:$F,6,0)),VLOOKUP(CONCATENATE($B28,\"-\",O$1),База!$A:$G,6,0))","v":"01:32:32.730"},2,{"$f":"IF(ISERROR(VLOOKUP(CONCATENATE($B28,\"-\",R$1),База!$A:$G,5,0)),IF(ISERROR(VLOOKUP(CONCATENATE($B28,\"-\",R$1),'База выдачи'!$A:$F,5,0)),\"\",VLOOKUP(CONCATENATE($B28,\"-\",R$1),'База выдачи'!$A:$F,5,0)),VLOOKUP(CONCATENATE($B28,\"-\",R$1),База!$A:$G,5,0))","v":"OK"},{"$f":"IF(ISERROR(VLOOKUP(CONCATENATE($B28,\"-\",R$1),База!$A:$G,6,0)),IF(ISERROR(VLOOKUP(CONCATENATE($B28,\"-\",R$1),'База выдачи'!$A:$F,6,0)),\"\",VLOOKUP(CONCATENATE($B28,\"-\",R$1),'База выдачи'!$A:$F,6,0)),VLOOKUP(CONCATENATE($B28,\"-\",R$1),База!$A:$G,6,0))","v":"02:31:19.330"},7,{"$f":"IF(ISERROR(VLOOKUP(CONCATENATE($B28,\"-\",U$1),База!$A:$G,5,0)),IF(ISERROR(VLOOKUP(CONCATENATE($B28,\"-\",U$1),'База выдачи'!$A:$F,5,0)),\"\",VLOOKUP(CONCATENATE($B28,\"-\",U$1),'База выдачи'!$A:$F,5,0)),VLOOKUP(CONCATENATE($B28,\"-\",U$1),База!$A:$G,5,0))","v":"OK"},{"$f":"IF(ISERROR(VLOOKUP(CONCATENATE($B28,\"-\",U$1),База!$A:$G,6,0)),IF(ISERROR(VLOOKUP(CONCATENATE($B28,\"-\",U$1),'База выдачи'!$A:$F,6,0)),\"\",VLOOKUP(CONCATENATE($B28,\"-\",U$1),'База выдачи'!$A:$F,6,0)),VLOOKUP(CONCATENATE($B28,\"-\",U$1),База!$A:$G,6,0))","v":"02:47:02.330"},3,{"$f":"IF(ISERROR(VLOOKUP(CONCATENATE($B28,\"-\",X$1),База!$A:$G,5,0)),IF(ISERROR(VLOOKUP(CONCATENATE($B28,\"-\",X$1),'База выдачи'!$A:$F,5,0)),\"\",VLOOKUP(CONCATENATE($B28,\"-\",X$1),'База выдачи'!$A:$F,5,0)),VLOOKUP(CONCATENATE($B28,\"-\",X$1),База!$A:$G,5,0))","v":"OK"},{"$f":"IF(ISERROR(VLOOKUP(CONCATENATE($B28,\"-\",X$1),База!$A:$G,6,0)),IF(ISERROR(VLOOKUP(CONCATENATE($B28,\"-\",X$1),'База выдачи'!$A:$F,6,0)),\"\",VLOOKUP(CONCATENATE($B28,\"-\",X$1),'База выдачи'!$A:$F,6,0)),VLOOKUP(CONCATENATE($B28,\"-\",X$1),База!$A:$G,6,0))","v":"03:02:51.270"},1,{"$f":"IF(ISERROR(VLOOKUP(CONCATENATE($B28,\"-\",AA$1),База!$A:$G,5,0)),IF(ISERROR(VLOOKUP(CONCATENATE($B28,\"-\",AA$1),'База выдачи'!$A:$F,5,0)),\"\",VLOOKUP(CONCATENATE($B28,\"-\",AA$1),'База выдачи'!$A:$F,5,0)),VLOOKUP(CONCATENATE($B28,\"-\",AA$1),База!$A:$G,5,0))","v":"ST"},{"$f":"IF(ISERROR(VLOOKUP(CONCATENATE($B28,\"-\",AA$1),База!$A:$G,6,0)),IF(ISERROR(VLOOKUP(CONCATENATE($B28,\"-\",AA$1),'База выдачи'!$A:$F,6,0)),\"\",VLOOKUP(CONCATENATE($B28,\"-\",AA$1),'База выдачи'!$A:$F,6,0)),VLOOKUP(CONCATENATE($B28,\"-\",AA$1),База!$A:$G,6,0))","v":"03:02:53.180"},"O",{"$f":"IF(ISERROR(VLOOKUP(CONCATENATE($B28,\"-\",AD$1),База!$A:$G,5,0)),IF(ISERROR(VLOOKUP(CONCATENATE($B28,\"-\",AD$1),'База выдачи'!$A:$F,5,0)),\"\",VLOOKUP(CONCATENATE($B28,\"-\",AD$1),'База выдачи'!$A:$F,5,0)),VLOOKUP(CONCATENATE($B28,\"-\",AD$1),База!$A:$G,5,0))","v":""},{"$f":"IF(ISERROR(VLOOKUP(CONCATENATE($B28,\"-\",AD$1),База!$A:$G,6,0)),IF(ISERROR(VLOOKUP(CONCATENATE($B28,\"-\",AD$1),'База выдачи'!$A:$F,6,0)),\"\",VLOOKUP(CONCATENATE($B28,\"-\",AD$1),'База выдачи'!$A:$F,6,0)),VLOOKUP(CONCATENATE($B28,\"-\",AD$1),База!$A:$G,6,0))","v":""},"A",{"$f":"IF(ISERROR(VLOOKUP(CONCATENATE($B28,\"-\",AG$1),База!$A:$G,5,0)),IF(ISERROR(VLOOKUP(CONCATENATE($B28,\"-\",AG$1),'База выдачи'!$A:$F,5,0)),\"\",VLOOKUP(CONCATENATE($B28,\"-\",AG$1),'База выдачи'!$A:$F,5,0)),VLOOKUP(CONCATENATE($B28,\"-\",AG$1),База!$A:$G,5,0))","v":""},{"$f":"IF(ISERROR(VLOOKUP(CONCATENATE($B28,\"-\",AG$1),База!$A:$G,6,0)),IF(ISERROR(VLOOKUP(CONCATENATE($B28,\"-\",AG$1),'База выдачи'!$A:$F,6,0)),\"\",VLOOKUP(CONCATENATE($B28,\"-\",AG$1),'База выдачи'!$A:$F,6,0)),VLOOKUP(CONCATENATE($B28,\"-\",AG$1),База!$A:$G,6,0))","v":""},"B",{"$f":"IF(ISERROR(VLOOKUP(CONCATENATE($B28,\"-\",AJ$1),База!$A:$G,5,0)),IF(ISERROR(VLOOKUP(CONCATENATE($B28,\"-\",AJ$1),'База выдачи'!$A:$F,5,0)),\"\",VLOOKUP(CONCATENATE($B28,\"-\",AJ$1),'База выдачи'!$A:$F,5,0)),VLOOKUP(CONCATENATE($B28,\"-\",AJ$1),База!$A:$G,5,0))","v":""},{"$f":"IF(ISERROR(VLOOKUP(CONCATENATE($B28,\"-\",AJ$1),База!$A:$G,6,0)),IF(ISERROR(VLOOKUP(CONCATENATE($B28,\"-\",AJ$1),'База выдачи'!$A:$F,6,0)),\"\",VLOOKUP(CONCATENATE($B28,\"-\",AJ$1),'База выдачи'!$A:$F,6,0)),VLOOKUP(CONCATENATE($B28,\"-\",AJ$1),База!$A:$G,6,0))","v":""},"C",{"$f":"IF(ISERROR(VLOOKUP(CONCATENATE($B28,\"-\",AM$1),База!$A:$G,5,0)),IF(ISERROR(VLOOKUP(CONCATENATE($B28,\"-\",AM$1),'База выдачи'!$A:$F,5,0)),\"\",VLOOKUP(CONCATENATE($B28,\"-\",AM$1),'База выдачи'!$A:$F,5,0)),VLOOKUP(CONCATENATE($B28,\"-\",AM$1),База!$A:$G,5,0))","v":""},{"$f":"IF(ISERROR(VLOOKUP(CONCATENATE($B28,\"-\",AM$1),База!$A:$G,6,0)),IF(ISERROR(VLOOKUP(CONCATENATE($B28,\"-\",AM$1),'База выдачи'!$A:$F,6,0)),\"\",VLOOKUP(CONCATENATE($B28,\"-\",AM$1),'База выдачи'!$A:$F,6,0)),VLOOKUP(CONCATENATE($B28,\"-\",AM$1),База!$A:$G,6,0))","v":""},"D",{"$f":"IF(ISERROR(VLOOKUP(CONCATENATE($B28,\"-\",AP$1),База!$A:$G,5,0)),IF(ISERROR(VLOOKUP(CONCATENATE($B28,\"-\",AP$1),'База выдачи'!$A:$F,5,0)),\"\",VLOOKUP(CONCATENATE($B28,\"-\",AP$1),'База выдачи'!$A:$F,5,0)),VLOOKUP(CONCATENATE($B28,\"-\",AP$1),База!$A:$G,5,0))","v":""},{"$f":"IF(ISERROR(VLOOKUP(CONCATENATE($B28,\"-\",AP$1),База!$A:$G,6,0)),IF(ISERROR(VLOOKUP(CONCATENATE($B28,\"-\",AP$1),'База выдачи'!$A:$F,6,0)),\"\",VLOOKUP(CONCATENATE($B28,\"-\",AP$1),'База выдачи'!$A:$F,6,0)),VLOOKUP(CONCATENATE($B28,\"-\",AP$1),База!$A:$G,6,0))","v":""},"E",{"$f":"IF(ISERROR(VLOOKUP(CONCATENATE($B28,\"-\",AS$1),База!$A:$G,5,0)),IF(ISERROR(VLOOKUP(CONCATENATE($B28,\"-\",AS$1),'База выдачи'!$A:$F,5,0)),\"\",VLOOKUP(CONCATENATE($B28,\"-\",AS$1),'База выдачи'!$A:$F,5,0)),VLOOKUP(CONCATENATE($B28,\"-\",AS$1),База!$A:$G,5,0))","v":""},{"$f":"IF(ISERROR(VLOOKUP(CONCATENATE($B28,\"-\",AS$1),База!$A:$G,6,0)),IF(ISERROR(VLOOKUP(CONCATENATE($B28,\"-\",AS$1),'База выдачи'!$A:$F,6,0)),\"\",VLOOKUP(CONCATENATE($B28,\"-\",AS$1),'База выдачи'!$A:$F,6,0)),VLOOKUP(CONCATENATE($B28,\"-\",AS$1),База!$A:$G,6,0))","v":""},null,null,{"$f":"COUNTIFS(База!B:B,Статистика!B28,База!E:E,\"OK\")","v":8},{"$f":"DE3","v":"03:02:51.270"},10971,{"$f":"COUNTIFS(База!B:B,Статистика!B28,База!E:E,\"XXXX\")","v":0},{"$f":"IF(AX28+AZ28+BA28=0,ксекундвигре-BD28,ксекундвигре*Статистика!AX28+(ксекундвигре-Статистика!AZ28)+Статистика!BA28)","v":86769},43537,26,11]
[27,{"$f":"IF(ISERROR(VLOOKUP(A29,Служебный!B:C,2,0)),\"\",A29&\"-\"&VLOOKUP(A29,Служебный!B:C,2,0))","v":"27-Всем пыждец"},9,{"$f":"IF(ISERROR(VLOOKUP(CONCATENATE($B29,\"-\",C$1),База!$A:$G,5,0)),IF(ISERROR(VLOOKUP(CONCATENATE($B29,\"-\",C$1),'База выдачи'!$A:$F,5,0)),\"\",VLOOKUP(CONCATENATE($B29,\"-\",C$1),'База выдачи'!$A:$F,5,0)),VLOOKUP(CONCATENATE($B29,\"-\",C$1),База!$A:$G,5,0))","v":"OK"},{"$f":"IF(ISERROR(VLOOKUP(CONCATENATE($B29,\"-\",C$1),База!$A:$G,6,0)),IF(ISERROR(VLOOKUP(CONCATENATE($B29,\"-\",C$1),'База выдачи'!$A:$F,6,0)),\"\",VLOOKUP(CONCATENATE($B29,\"-\",C$1),'База выдачи'!$A:$F,6,0)),VLOOKUP(CONCATENATE($B29,\"-\",C$1),База!$A:$G,6,0))","v":"00:25:06.620"},8,{"$f":"IF(ISERROR(VLOOKUP(CONCATENATE($B29,\"-\",F$1),База!$A:$G,5,0)),IF(ISERROR(VLOOKUP(CONCATENATE($B29,\"-\",F$1),'База выдачи'!$A:$F,5,0)),\"\",VLOOKUP(CONCATENATE($B29,\"-\",F$1),'База выдачи'!$A:$F,5,0)),VLOOKUP(CONCATENATE($B29,\"-\",F$1),База!$A:$G,5,0))","v":"OK"},{"$f":"IF(ISERROR(VLOOKUP(CONCATENATE($B29,\"-\",F$1),База!$A:$G,6,0)),IF(ISERROR(VLOOKUP(CONCATENATE($B29,\"-\",F$1),'База выдачи'!$A:$F,6,0)),\"\",VLOOKUP(CONCATENATE($B29,\"-\",F$1),'База выдачи'!$A:$F,6,0)),VLOOKUP(CONCATENATE($B29,\"-\",F$1),База!$A:$G,6,0))","v":"00:43:28.350"},7,{"$f":"IF(ISERROR(VLOOKUP(CONCATENATE($B29,\"-\",I$1),База!$A:$G,5,0)),IF(ISERROR(VLOOKUP(CONCATENATE($B29,\"-\",I$1),'База выдачи'!$A:$F,5,0)),\"\",VLOOKUP(CONCATENATE($B29,\"-\",I$1),'База выдачи'!$A:$F,5,0)),VLOOKUP(CONCATENATE($B29,\"-\",I$1),База!$A:$G,5,0))","v":"OK"},{"$f":"IF(ISERROR(VLOOKUP(CONCATENATE($B29,\"-\",I$1),База!$A:$G,6,0)),IF(ISERROR(VLOOKUP(CONCATENATE($B29,\"-\",I$1),'База выдачи'!$A:$F,6,0)),\"\",VLOOKUP(CONCATENATE($B29,\"-\",I$1),'База выдачи'!$A:$F,6,0)),VLOOKUP(CONCATENATE($B29,\"-\",I$1),База!$A:$G,6,0))","v":"01:03:55.140"},1,{"$f":"IF(ISERROR(VLOOKUP(CONCATENATE($B29,\"-\",L$1),База!$A:$G,5,0)),IF(ISERROR(VLOOKUP(CONCATENATE($B29,\"-\",L$1),'База выдачи'!$A:$F,5,0)),\"\",VLOOKUP(CONCATENATE($B29,\"-\",L$1),'База выдачи'!$A:$F,5,0)),VLOOKUP(CONCATENATE($B29,\"-\",L$1),База!$A:$G,5,0))","v":"XXXX"},{"$f":"IF(ISERROR(VLOOKUP(CONCATENATE($B29,\"-\",L$1),База!$A:$G,6,0)),IF(ISERROR(VLOOKUP(CONCATENATE($B29,\"-\",L$1),'База выдачи'!$A:$F,6,0)),\"\",VLOOKUP(CONCATENATE($B29,\"-\",L$1),'База выдачи'!$A:$F,6,0)),VLOOKUP(CONCATENATE($B29,\"-\",L$1),База!$A:$G,6,0))","v":"01:48:17.220"},4,{"$f":"IF(ISERROR(VLOOKUP(CONCATENATE($B29,\"-\",O$1),База!$A:$G,5,0)),IF(ISERROR(VLOOKUP(CONCATENATE($B29,\"-\",O$1),'База выдачи'!$A:$F,5,0)),\"\",VLOOKUP(CONCATENATE($B29,\"-\",O$1),'База выдачи'!$A:$F,5,0)),VLOOKUP(CONCATENATE($B29,\"-\",O$1),База!$A:$G,5,0))","v":"OK"},{"$f":"IF(ISERROR(VLOOKUP(CONCATENATE($B29,\"-\",O$1),База!$A:$G,6,0)),IF(ISERROR(VLOOKUP(CONCATENATE($B29,\"-\",O$1),'База выдачи'!$A:$F,6,0)),\"\",VLOOKUP(CONCATENATE($B29,\"-\",O$1),'База выдачи'!$A:$F,6,0)),VLOOKUP(CONCATENATE($B29,\"-\",O$1),База!$A:$G,6,0))","v":"01:58:01.800"},6,{"$f":"IF(ISERROR(VLOOKUP(CONCATENATE($B29,\"-\",R$1),База!$A:$G,5,0)),IF(ISERROR(VLOOKUP(CONCATENATE($B29,\"-\",R$1),'База выдачи'!$A:$F,5,0)),\"\",VLOOKUP(CONCATENATE($B29,\"-\",R$1),'База выдачи'!$A:$F,5,0)),VLOOKUP(CONCATENATE($B29,\"-\",R$1),База!$A:$G,5,0))","v":"OK"},{"$f":"IF(ISERROR(VLOOKUP(CONCATENATE($B29,\"-\",R$1),База!$A:$G,6,0)),IF(ISERROR(VLOOKUP(CONCATENATE($B29,\"-\",R$1),'База выдачи'!$A:$F,6,0)),\"\",VLOOKUP(CONCATENATE($B29,\"-\",R$1),'База выдачи'!$A:$F,6,0)),VLOOKUP(CONCATENATE($B29,\"-\",R$1),База!$A:$G,6,0))","v":"02:45:12.350"},3,{"$f":"IF(ISERROR(VLOOKUP(CONCATENATE($B29,\"-\",U$1),База!$A:$G,5,0)),IF(ISERROR(VLOOKUP(CONCATENATE($B29,\"-\",U$1),'База выдачи'!$A:$F,5,0)),\"\",VLOOKUP(CONCATENATE($B29,\"-\",U$1),'База выдачи'!$A:$F,5,0)),VLOOKUP(CONCATENATE($B29,\"-\",U$1),База!$A:$G,5,0))","v":"OK"},{"$f":"IF(ISERROR(VLOOKUP(CONCATENATE($B29,\"-\",U$1),База!$A:$G,6,0)),IF(ISERROR(VLOOKUP(CONCATENATE($B29,\"-\",U$1),'База выдачи'!$A:$F,6,0)),\"\",VLOOKUP(CONCATENATE($B29,\"-\",U$1),'База выдачи'!$A:$F,6,0)),VLOOKUP(CONCATENATE($B29,\"-\",U$1),База!$A:$G,6,0))","v":"03:02:29.460"},2,{"$f":"IF(ISERROR(VLOOKUP(CONCATENATE($B29,\"-\",X$1),База!$A:$G,5,0)),IF(ISERROR(VLOOKUP(CONCATENATE($B29,\"-\",X$1),'База выдачи'!$A:$F,5,0)),\"\",VLOOKUP(CONCATENATE($B29,\"-\",X$1),'База выдачи'!$A:$F,5,0)),VLOOKUP(CONCATENATE($B29,\"-\",X$1),База!$A:$G,5,0))","v":"ST"},{"$f":"IF(ISERROR(VLOOKUP(CONCATENATE($B29,\"-\",X$1),База!$A:$G,6,0)),IF(ISERROR(VLOOKUP(CONCATENATE($B29,\"-\",X$1),'База выдачи'!$A:$F,6,0)),\"\",VLOOKUP(CONCATENATE($B29,\"-\",X$1),'База выдачи'!$A:$F,6,0)),VLOOKUP(CONCATENATE($B29,\"-\",X$1),База!$A:$G,6,0))","v":"03:02:31.390"},5,{"$f":"IF(ISERROR(VLOOKUP(CONCATENATE($B29,\"-\",AA$1),База!$A:$G,5,0)),IF(ISERROR(VLOOKUP(CONCATENATE($B29,\"-\",AA$1),'База выдачи'!$A:$F,5,0)),\"\",VLOOKUP(CONCATENATE($B29,\"-\",AA$1),'База выдачи'!$A:$F,5,0)),VLOOKUP(CONCATENATE($B29,\"-\",AA$1),База!$A:$G,5,0))","v":""},{"$f":"IF(ISERROR(VLOOKUP(CONCATENATE($B29,\"-\",AA$1),База!$A:$G,6,0)),IF(ISERROR(VLOOKUP(CONCATENATE($B29,\"-\",AA$1),'База выдачи'!$A:$F,6,0)),\"\",VLOOKUP(CONCATENATE($B29,\"-\",AA$1),'База выдачи'!$A:$F,6,0)),VLOOKUP(CONCATENATE($B29,\"-\",AA$1),База!$A:$G,6,0))","v":""},"N",{"$f":"IF(ISERROR(VLOOKUP(CONCATENATE($B29,\"-\",AD$1),База!$A:$G,5,0)),IF(ISERROR(VLOOKUP(CONCATENATE($B29,\"-\",AD$1),'База выдачи'!$A:$F,5,0)),\"\",VLOOKUP(CONCATENATE($B29,\"-\",AD$1),'База выдачи'!$A:$F,5,0)),VLOOKUP(CONCATENATE($B29,\"-\",AD$1),База!$A:$G,5,0))","v":""},{"$f":"IF(ISERROR(VLOOKUP(CONCATENATE($B29,\"-\",AD$1),База!$A:$G,6,0)),IF(ISERROR(VLOOKUP(CONCATENATE($B29,\"-\",AD$1),'База выдачи'!$A:$F,6,0)),\"\",VLOOKUP(CONCATENATE($B29,\"-\",AD$1),'База выдачи'!$A:$F,6,0)),VLOOKUP(CONCATENATE($B29,\"-\",AD$1),База!$A:$G,6,0))","v":""},"O",{"$f":"IF(ISERROR(VLOOKUP(CONCATENATE($B29,\"-\",AG$1),База!$A:$G,5,0)),IF(ISERROR(VLOOKUP(CONCATENATE($B29,\"-\",AG$1),'База выдачи'!$A:$F,5,0)),\"\",VLOOKUP(CONCATENATE($B29,\"-\",AG$1),'База выдачи'!$A:$F,5,0)),VLOOKUP(CONCATENATE($B29,\"-\",AG$1),База!$A:$G,5,0))","v":""},{"$f":"IF(ISERROR(VLOOKUP(CONCATENATE($B29,\"-\",AG$1),База!$A:$G,6,0)),IF(ISERROR(VLOOKUP(CONCATENATE($B29,\"-\",AG$1),'База выдачи'!$A:$F,6,0)),\"\",VLOOKUP(CONCATENATE($B29,\"-\",AG$1),'База выдачи'!$A:$F,6,0)),VLOOKUP(CONCATENATE($B29,\"-\",AG$1),База!$A:$G,6,0))","v":""},"A",{"$f":"IF(ISERROR(VLOOKUP(CONCATENATE($B29,\"-\",AJ$1),База!$A:$G,5,0)),IF(ISERROR(VLOOKUP(CONCATENATE($B29,\"-\",AJ$1),'База выдачи'!$A:$F,5,0)),\"\",VLOOKUP(CONCATENATE($B29,\"-\",AJ$1),'База выдачи'!$A:$F,5,0)),VLOOKUP(CONCATENATE($B29,\"-\",AJ$1),База!$A:$G,5,0))","v":""},{"$f":"IF(ISERROR(VLOOKUP(CONCATENATE($B29,\"-\",AJ$1),База!$A:$G,6,0)),IF(ISERROR(VLOOKUP(CONCATENATE($B29,\"-\",AJ$1),'База выдачи'!$A:$F,6,0)),\"\",VLOOKUP(CONCATENATE($B29,\"-\",AJ$1),'База выдачи'!$A:$F,6,0)),VLOOKUP(CONCATENATE($B29,\"-\",AJ$1),База!$A:$G,6,0))","v":""},"B",{"$f":"IF(ISERROR(VLOOKUP(CONCATENATE($B29,\"-\",AM$1),База!$A:$G,5,0)),IF(ISERROR(VLOOKUP(CONCATENATE($B29,\"-\",AM$1),'База выдачи'!$A:$F,5,0)),\"\",VLOOKUP(CONCATENATE($B29,\"-\",AM$1),'База выдачи'!$A:$F,5,0)),VLOOKUP(CONCATENATE($B29,\"-\",AM$1),База!$A:$G,5,0))","v":""},{"$f":"IF(ISERROR(VLOOKUP(CONCATENATE($B29,\"-\",AM$1),База!$A:$G,6,0)),IF(ISERROR(VLOOKUP(CONCATENATE($B29,\"-\",AM$1),'База выдачи'!$A:$F,6,0)),\"\",VLOOKUP(CONCATENATE($B29,\"-\",AM$1),'База выдачи'!$A:$F,6,0)),VLOOKUP(CONCATENATE($B29,\"-\",AM$1),База!$A:$G,6,0))","v":""},"C",{"$f":"IF(ISERROR(VLOOKUP(CONCATENATE($B29,\"-\",AP$1),База!$A:$G,5,0)),IF(ISERROR(VLOOKUP(CONCATENATE($B29,\"-\",AP$1),'База выдачи'!$A:$F,5,0)),\"\",VLOOKUP(CONCATENATE($B29,\"-\",AP$1),'База выдачи'!$A:$F,5,0)),VLOOKUP(CONCATENATE($B29,\"-\",AP$1),База!$A:$G,5,0))","v":""},{"$f":"IF(ISERROR(VLOOKUP(CONCATENATE($B29,\"-\",AP$1),База!$A:$G,6,0)),IF(ISERROR(VLOOKUP(CONCATENATE($B29,\"-\",AP$1),'База выдачи'!$A:$F,6,0)),\"\",VLOOKUP(CONCATENATE($B29,\"-\",AP$1),'База выдачи'!$A:$F,6,0)),VLOOKUP(CONCATENATE($B29,\"-\",AP$1),База!$A:$G,6,0))","v":""},"D",{"$f":"IF(ISERROR(VLOOKUP(CONCATENATE($B29,\"-\",AS$1),База!$A:$G,5,0)),IF(ISERROR(VLOOKUP(CONCATENATE($B29,\"-\",AS$1),'База выдачи'!$A:$F,5,0)),\"\",VLOOKUP(CONCATENATE($B29,\"-\",AS$1),'База выдачи'!$A:$F,5,0)),VLOOKUP(CONCATENATE($B29,\"-\",AS$1),База!$A:$G,5,0))","v":""},{"$f":"IF(ISERROR(VLOOKUP(CONCATENATE($B29,\"-\",AS$1),База!$A:$G,6,0)),IF(ISERROR(VLOOKUP(CONCATENATE($B29,\"-\",AS$1),'База выдачи'!$A:$F,6,0)),\"\",VLOOKUP(CONCATENATE($B29,\"-\",AS$1),'База выдачи'!$A:$F,6,0)),VLOOKUP(CONCATENATE($B29,\"-\",AS$1),База!$A:$G,6,0))","v":""},null,null,{"$f":"COUNTIFS(База!B:B,Статистика!B29,База!E:E,\"OK\")","v":6},{"$f":"DG3","v":"03:02:29.460"},10949,{"$f":"COUNTIFS(База!B:B,Статистика!B29,База!E:E,\"XXXX\")","v":1},{"$f":"IF(AX29+AZ29+BA29=0,ксекундвигре-BD29,ксекундвигре*Статистика!AX29+(ксекундвигре-Статистика!AZ29)+Статистика!BA29)","v":65072},35674,27,10]
[28,{"$f":"IF(ISERROR(VLOOKUP(A30,Служебный!B:C,2,0)),\"\",A30&\"-\"&VLOOKUP(A30,Служебный!B:C,2,0))","v":"28-Тригада"},1,{"$f":"IF(ISERROR(VLOOKUP(CONCATENATE($B30,\"-\",C$1),База!$A:$G,5,0)),IF(ISERROR(VLOOKUP(CONCATENATE($B30,\"-\",C$1),'База выдачи'!$A:$F,5,0)),\"\",VLOOKUP(CONCATENATE($B30,\"-\",C$1),'База выдачи'!$A:$F,5,0)),VLOOKUP(CONCATENATE($B30,\"-\",C$1),База!$A:$G,5,0))","v":"OK"},{"$f":"IF(ISERROR(VLOOKUP(CONCATENATE($B30,\"-\",C$1),База!$A:$G,6,0)),IF(ISERROR(VLOOKUP(CONCATENATE($B30,\"-\",C$1),'База выдачи'!$A:$F,6,0)),\"\",VLOOKUP(CONCATENATE($B30,\"-\",C$1),'База выдачи'!$A:$F,6,0)),VLOOKUP(CONCATENATE($B30,\"-\",C$1),База!$A:$G,6,0))","v":"01:36:24.620"},3,{"$f":"IF(ISERROR(VLOOKUP(CONCATENATE($B30,\"-\",F$1),База!$A:$G,5,0)),IF(ISERROR(VLOOKUP(CONCATENATE($B30,\"-\",F$1),'База выдачи'!$A:$F,5,0)),\"\",VLOOKUP(CONCATENATE($B30,\"-\",F$1),'База выдачи'!$A:$F,5,0)),VLOOKUP(CONCATENATE($B30,\"-\",F$1),База!$A:$G,5,0))","v":"OK"},{"$f":"IF(ISERROR(VLOOKUP(CONCATENATE($B30,\"-\",F$1),База!$A:$G,6,0)),IF(ISERROR(VLOOKUP(CONCATENATE($B30,\"-\",F$1),'База выдачи'!$A:$F,6,0)),\"\",VLOOKUP(CONCATENATE($B30,\"-\",F$1),'База выдачи'!$A:$F,6,0)),VLOOKUP(CONCATENATE($B30,\"-\",F$1),База!$A:$G,6,0))","v":"01:54:12.710"},5,{"$f":"IF(ISERROR(VLOOKUP(CONCATENATE($B30,\"-\",I$1),База!$A:$G,5,0)),IF(ISERROR(VLOOKUP(CONCATENATE($B30,\"-\",I$1),'База выдачи'!$A:$F,5,0)),\"\",VLOOKUP(CONCATENATE($B30,\"-\",I$1),'База выдачи'!$A:$F,5,0)),VLOOKUP(CONCATENATE($B30,\"-\",I$1),База!$A:$G,5,0))","v":"OK"},{"$f":"IF(ISERROR(VLOOKUP(CONCATENATE($B30,\"-\",I$1),База!$A:$G,6,0)),IF(ISERROR(VLOOKUP(CONCATENATE($B30,\"-\",I$1),'База выдачи'!$A:$F,6,0)),\"\",VLOOKUP(CONCATENATE($B30,\"-\",I$1),'База выдачи'!$A:$F,6,0)),VLOOKUP(CONCATENATE($B30,\"-\",I$1),База!$A:$G,6,0))","v":"02:10:49"},2,{"$f":"IF(ISERROR(VLOOKUP(CONCATENATE($B30,\"-\",L$1),База!$A:$G,5,0)),IF(ISERROR(VLOOKUP(CONCATENATE($B30,\"-\",L$1),'База выдачи'!$A:$F,5,0)),\"\",VLOOKUP(CONCATENATE($B30,\"-\",L$1),'База выдачи'!$A:$F,5,0)),VLOOKUP(CONCATENATE($B30,\"-\",L$1),База!$A:$G,5,0))","v":"OK"},{"$f":"IF(ISERROR(VLOOKUP(CONCATENATE($B30,\"-\",L$1),База!$A:$G,6,0)),IF(ISERROR(VLOOKUP(CONCATENATE($B30,\"-\",L$1),'База выдачи'!$A:$F,6,0)),\"\",VLOOKUP(CONCATENATE($B30,\"-\",L$1),'База выдачи'!$A:$F,6,0)),VLOOKUP(CONCATENATE($B30,\"-\",L$1),База!$A:$G,6,0))","v":"02:37:45.800"},4,{"$f":"IF(ISERROR(VLOOKUP(CONCATENATE($B30,\"-\",O$1),База!$A:$G,5,0)),IF(ISERROR(VLOOKUP(CONCATENATE($B30,\"-\",O$1),'База выдачи'!$A:$F,5,0)),\"\",VLOOKUP(CONCATENATE($B30,\"-\",O$1),'База выдачи'!$A:$F,5,0)),VLOOKUP(CONCATENATE($B30,\"-\",O$1),База!$A:$G,5,0))","v":"ST"},{"$f":"IF(ISERROR(VLOOKUP(CONCATENATE($B30,\"-\",O$1),База!$A:$G,6,0)),IF(ISERROR(VLOOKUP(CONCATENATE($B30,\"-\",O$1),'База выдачи'!$A:$F,6,0)),\"\",VLOOKUP(CONCATENATE($B30,\"-\",O$1),'База выдачи'!$A:$F,6,0)),VLOOKUP(CONCATENATE($B30,\"-\",O$1),База!$A:$G,6,0))","v":"02:37:47.720"},6,{"$f":"IF(ISERROR(VLOOKUP(CONCATENATE($B30,\"-\",R$1),База!$A:$G,5,0)),IF(ISERROR(VLOOKUP(CONCATENATE($B30,\"-\",R$1),'База выдачи'!$A:$F,5,0)),\"\",VLOOKUP(CONCATENATE($B30,\"-\",R$1),'База выдачи'!$A:$F,5,0)),VLOOKUP(CONCATENATE($B30,\"-\",R$1),База!$A:$G,5,0))","v":""},{"$f":"IF(ISERROR(VLOOKUP(CONCATENATE($B30,\"-\",R$1),База!$A:$G,6,0)),IF(ISERROR(VLOOKUP(CONCATENATE($B30,\"-\",R$1),'База выдачи'!$A:$F,6,0)),\"\",VLOOKUP(CONCATENATE($B30,\"-\",R$1),'База выдачи'!$A:$F,6,0)),VLOOKUP(CONCATENATE($B30,\"-\",R$1),База!$A:$G,6,0))","v":""},8,{"$f":"IF(ISERROR(VLOOKUP(CONCATENATE($B30,\"-\",U$1),База!$A:$G,5,0)),IF(ISERROR(VLOOKUP(CONCATENATE($B30,\"-\",U$1),'База выдачи'!$A:$F,5,0)),\"\",VLOOKUP(CONCATENATE($B30,\"-\",U$1),'База выдачи'!$A:$F,5,0)),VLOOKUP(CONCATENATE($B30,\"-\",U$1),База!$A:$G,5,0))","v":""},{"$f":"IF(ISERROR(VLOOKUP(CONCATENATE($B30,\"-\",U$1),База!$A:$G,6,0)),IF(ISERROR(VLOOKUP(CONCATENATE($B30,\"-\",U$1),'База выдачи'!$A:$F,6,0)),\"\",VLOOKUP(CONCATENATE($B30,\"-\",U$1),'База выдачи'!$A:$F,6,0)),VLOOKUP(CONCATENATE($B30,\"-\",U$1),База!$A:$G,6,0))","v":""},9,{"$f":"IF(ISERROR(VLOOKUP(CONCATENATE($B30,\"-\",X$1),База!$A:$G,5,0)),IF(ISERROR(VLOOKUP(CONCATENATE($B30,\"-\",X$1),'База выдачи'!$A:$F,5,0)),\"\",VLOOKUP(CONCATENATE($B30,\"-\",X$1),'База выдачи'!$A:$F,5,0)),VLOOKUP(CONCATENATE($B30,\"-\",X$1),База!$A:$G,5,0))","v":""},{"$f":"IF(ISERROR(VLOOKUP(CONCATENATE($B30,\"-\",X$1),База!$A:$G,6,0)),IF(ISERROR(VLOOKUP(CONCATENATE($B30,\"-\",X$1),'База выдачи'!$A:$F,6,0)),\"\",VLOOKUP(CONCATENATE($B30,\"-\",X$1),'База выдачи'!$A:$F,6,0)),VLOOKUP(CONCATENATE($B30,\"-\",X$1),База!$A:$G,6,0))","v":""},7,{"$f":"IF(ISERROR(VLOOKUP(CONCATENATE($B30,\"-\",AA$1),База!$A:$G,5,0)),IF(ISERROR(VLOOKUP(CONCATENATE($B30,\"-\",AA$1),'База выдачи'!$A:$F,5,0)),\"\",VLOOKUP(CONCATENATE($B30,\"-\",AA$1),'База выдачи'!$A:$F,5,0)),VLOOKUP(CONCATENATE($B30,\"-\",AA$1),База!$A:$G,5,0))","v":""},{"$f":"IF(ISERROR(VLOOKUP(CONCATENATE($B30,\"-\",AA$1),База!$A:$G,6,0)),IF(ISERROR(VLOOKUP(CONCATENATE($B30,\"-\",AA$1),'База выдачи'!$A:$F,6,0)),\"\",VLOOKUP(CONCATENATE($B30,\"-\",AA$1),'База выдачи'!$A:$F,6,0)),VLOOKUP(CONCATENATE($B30,\"-\",AA$1),База!$A:$G,6,0))","v":""},"M",{"$f":"IF(ISERROR(VLOOKUP(CONCATENATE($B30,\"-\",AD$1),База!$A:$G,5,0)),IF(ISERROR(VLOOKUP(CONCATENATE($B30,\"-\",AD$1),'База выдачи'!$A:$F,5,0)),\"\",VLOOKUP(CONCATENATE($B30,\"-\",AD$1),'База выдачи'!$A:$F,5,0)),VLOOKUP(CONCATENATE($B30,\"-\",AD$1),База!$A:$G,5,0))","v":""},{"$f":"IF(ISERROR(VLOOKUP(CONCATENATE($B30,\"-\",AD$1),База!$A:$G,6,0)),IF(ISERROR(VLOOKUP(CONCATENATE($B30,\"-\",AD$1),'База выдачи'!$A:$F,6,0)),\"\",VLOOKUP(CONCATENATE($B30,\"-\",AD$1),'База выдачи'!$A:$F,6,0)),VLOOKUP(CONCATENATE($B30,\"-\",AD$1),База!$A:$G,6,0))","v":""},"N",{"$f":"IF(ISERROR(VLOOKUP(CONCATENATE($B30,\"-\",AG$1),База!$A:$G,5,0)),IF(ISERROR(VLOOKUP(CONCATENATE($B30,\"-\",AG$1),'База выдачи'!$A:$F,5,0)),\"\",VLOOKUP(CONCATENATE($B30,\"-\",AG$1),'База выдачи'!$A:$F,5,0)),VLOOKUP(CONCATENATE($B30,\"-\",AG$1),База!$A:$G,5,0))","v":""},{"$f":"IF(ISERROR(VLOOKUP(CONCATENATE($B30,\"-\",AG$1),База!$A:$G,6,0)),IF(ISERROR(VLOOKUP(CONCATENATE($B30,\"-\",AG$1),'База выдачи'!$A:$F,6,0)),\"\",VLOOKUP(CONCATENATE($B30,\"-\",AG$1),'База выдачи'!$A:$F,6,0)),VLOOKUP(CONCATENATE($B30,\"-\",AG$1),База!$A:$G,6,0))","v":""},"O",{"$f":"IF(ISERROR(VLOOKUP(CONCATENATE($B30,\"-\",AJ$1),База!$A:$G,5,0)),IF(ISERROR(VLOOKUP(CONCATENATE($B30,\"-\",AJ$1),'База выдачи'!$A:$F,5,0)),\"\",VLOOKUP(CONCATENATE($B30,\"-\",AJ$1),'База выдачи'!$A:$F,5,0)),VLOOKUP(CONCATENATE($B30,\"-\",AJ$1),База!$A:$G,5,0))","v":""},{"$f":"IF(ISERROR(VLOOKUP(CONCATENATE($B30,\"-\",AJ$1),База!$A:$G,6,0)),IF(ISERROR(VLOOKUP(CONCATENATE($B30,\"-\",AJ$1),'База выдачи'!$A:$F,6,0)),\"\",VLOOKUP(CONCATENATE($B30,\"-\",AJ$1),'База выдачи'!$A:$F,6,0)),VLOOKUP(CONCATENATE($B30,\"-\",AJ$1),База!$A:$G,6,0))","v":""},"A",{"$f":"IF(ISERROR(VLOOKUP(CONCATENATE($B30,\"-\",AM$1),База!$A:$G,5,0)),IF(ISERROR(VLOOKUP(CONCATENATE($B30,\"-\",AM$1),'База выдачи'!$A:$F,5,0)),\"\",VLOOKUP(CONCATENATE($B30,\"-\",AM$1),'База выдачи'!$A:$F,5,0)),VLOOKUP(CONCATENATE($B30,\"-\",AM$1),База!$A:$G,5,0))","v":""},{"$f":"IF(ISERROR(VLOOKUP(CONCATENATE($B30,\"-\",AM$1),База!$A:$G,6,0)),IF(ISERROR(VLOOKUP(CONCATENATE($B30,\"-\",AM$1),'База выдачи'!$A:$F,6,0)),\"\",VLOOKUP(CONCATENATE($B30,\"-\",AM$1),'База выдачи'!$A:$F,6,0)),VLOOKUP(CONCATENATE($B30,\"-\",AM$1),База!$A:$G,6,0))","v":""},"B",{"$f":"IF(ISERROR(VLOOKUP(CONCATENATE($B30,\"-\",AP$1),База!$A:$G,5,0)),IF(ISERROR(VLOOKUP(CONCATENATE($B30,\"-\",AP$1),'База выдачи'!$A:$F,5,0)),\"\",VLOOKUP(CONCATENATE($B30,\"-\",AP$1),'База выдачи'!$A:$F,5,0)),VLOOKUP(CONCATENATE($B30,\"-\",AP$1),База!$A:$G,5,0))","v":""},{"$f":"IF(ISERROR(VLOOKUP(CONCATENATE($B30,\"-\",AP$1),База!$A:$G,6,0)),IF(ISERROR(VLOOKUP(CONCATENATE($B30,\"-\",AP$1),'База выдачи'!$A:$F,6,0)),\"\",VLOOKUP(CONCATENATE($B30,\"-\",AP$1),'База выдачи'!$A:$F,6,0)),VLOOKUP(CONCATENATE($B30,\"-\",AP$1),База!$A:$G,6,0))","v":""},"C",{"$f":"IF(ISERROR(VLOOKUP(CONCATENATE($B30,\"-\",AS$1),База!$A:$G,5,0)),IF(ISERROR(VLOOKUP(CONCATENATE($B30,\"-\",AS$1),'База выдачи'!$A:$F,5,0)),\"\",VLOOKUP(CONCATENATE($B30,\"-\",AS$1),'База выдачи'!$A:$F,5,0)),VLOOKUP(CONCATENATE($B30,\"-\",AS$1),База!$A:$G,5,0))","v":""},{"$f":"IF(ISERROR(VLOOKUP(CONCATENATE($B30,\"-\",AS$1),База!$A:$G,6,0)),IF(ISERROR(VLOOKUP(CONCATENATE($B30,\"-\",AS$1),'База выдачи'!$A:$F,6,0)),\"\",VLOOKUP(CONCATENATE($B30,\"-\",AS$1),'База выдачи'!$A:$F,6,0)),VLOOKUP(CONCATENATE($B30,\"-\",AS$1),База!$A:$G,6,0))","v":""},null,null,{"$f":"COUNTIFS(База!B:B,Статистика!B30,База!E:E,\"OK\")","v":4},{"$f":"DI3","v":"02:37:45.800"},9466,{"$f":"COUNTIFS(База!B:B,Статистика!B30,База!E:E,\"XXXX\")","v":0},{"$f":"IF(AX30+AZ30+BA30=0,ксекундвигре-BD30,ксекундвигре*Статистика!AX30+(ксекундвигре-Статистика!AZ30)+Статистика!BA30)","v":44834},35031,28,1]
[29,{"$f":"IF(ISERROR(VLOOKUP(A31,Служебный!B:C,2,0)),\"\",A31&\"-\"&VLOOKUP(A31,Служебный!B:C,2,0))","v":"29-ЛеТим"},2,{"$f":"IF(ISERROR(VLOOKUP(CONCATENATE($B31,\"-\",C$1),База!$A:$G,5,0)),IF(ISERROR(VLOOKUP(CONCATENATE($B31,\"-\",C$1),'База выдачи'!$A:$F,5,0)),\"\",VLOOKUP(CONCATENATE($B31,\"-\",C$1),'База выдачи'!$A:$F,5,0)),VLOOKUP(CONCATENATE($B31,\"-\",C$1),База!$A:$G,5,0))","v":"OK"},{"$f":"IF(ISERROR(VLOOKUP(CONCATENATE($B31,\"-\",C$1),База!$A:$G,6,0)),IF(ISERROR(VLOOKUP(CONCATENATE($B31,\"-\",C$1),'База выдачи'!$A:$F,6,0)),\"\",VLOOKUP(CONCATENATE($B31,\"-\",C$1),'База выдачи'!$A:$F,6,0)),VLOOKUP(CONCATENATE($B31,\"-\",C$1),База!$A:$G,6,0))","v":"00:42:14.960"},4,{"$f":"IF(ISERROR(VLOOKUP(CONCATENATE($B31,\"-\",F$1),База!$A:$G,5,0)),IF(ISERROR(VLOOKUP(CONCATENATE($B31,\"-\",F$1),'База выдачи'!$A:$F,5,0)),\"\",VLOOKUP(CONCATENATE($B31,\"-\",F$1),'База выдачи'!$A:$F,5,0)),VLOOKUP(CONCATENATE($B31,\"-\",F$1),База!$A:$G,5,0))","v":"OK"},{"$f":"IF(ISERROR(VLOOKUP(CONCATENATE($B31,\"-\",F$1),База!$A:$G,6,0)),IF(ISERROR(VLOOKUP(CONCATENATE($B31,\"-\",F$1),'База выдачи'!$A:$F,6,0)),\"\",VLOOKUP(CONCATENATE($B31,\"-\",F$1),'База выдачи'!$A:$F,6,0)),VLOOKUP(CONCATENATE($B31,\"-\",F$1),База!$A:$G,6,0))","v":"01:07:52.230"},6,{"$f":"IF(ISERROR(VLOOKUP(CONCATENATE($B31,\"-\",I$1),База!$A:$G,5,0)),IF(ISERROR(VLOOKUP(CONCATENATE($B31,\"-\",I$1),'База выдачи'!$A:$F,5,0)),\"\",VLOOKUP(CONCATENATE($B31,\"-\",I$1),'База выдачи'!$A:$F,5,0)),VLOOKUP(CONCATENATE($B31,\"-\",I$1),База!$A:$G,5,0))","v":"XXXX"},{"$f":"IF(ISERROR(VLOOKUP(CONCATENATE($B31,\"-\",I$1),База!$A:$G,6,0)),IF(ISERROR(VLOOKUP(CONCATENATE($B31,\"-\",I$1),'База выдачи'!$A:$F,6,0)),\"\",VLOOKUP(CONCATENATE($B31,\"-\",I$1),'База выдачи'!$A:$F,6,0)),VLOOKUP(CONCATENATE($B31,\"-\",I$1),База!$A:$G,6,0))","v":"02:01:08.310"},8,{"$f":"IF(ISERROR(VLOOKUP(CONCATENATE($B31,\"-\",L$1),База!$A:$G,5,0)),IF(ISERROR(VLOOKUP(CONCATENATE($B31,\"-\",L$1),'База выдачи'!$A:$F,5,0)),\"\",VLOOKUP(CONCATENATE($B31,\"-\",L$1),'База выдачи'!$A:$F,5,0)),VLOOKUP(CONCATENATE($B31,\"-\",L$1),База!$A:$G,5,0))","v":"OK"},{"$f":"IF(ISERROR(VLOOKUP(CONCATENATE($B31,\"-\",L$1),База!$A:$G,6,0)),IF(ISERROR(VLOOKUP(CONCATENATE($B31,\"-\",L$1),'База выдачи'!$A:$F,6,0)),\"\",VLOOKUP(CONCATENATE($B31,\"-\",L$1),'База выдачи'!$A:$F,6,0)),VLOOKUP(CONCATENATE($B31,\"-\",L$1),База!$A:$G,6,0))","v":"02:15:00.190"},9,{"$f":"IF(ISERROR(VLOOKUP(CONCATENATE($B31,\"-\",O$1),База!$A:$G,5,0)),IF(ISERROR(VLOOKUP(CONCATENATE($B31,\"-\",O$1),'База выдачи'!$A:$F,5,0)),\"\",VLOOKUP(CONCATENATE($B31,\"-\",O$1),'База выдачи'!$A:$F,5,0)),VLOOKUP(CONCATENATE($B31,\"-\",O$1),База!$A:$G,5,0))","v":"OK"},{"$f":"IF(ISERROR(VLOOKUP(CONCATENATE($B31,\"-\",O$1),База!$A:$G,6,0)),IF(ISERROR(VLOOKUP(CONCATENATE($B31,\"-\",O$1),'База выдачи'!$A:$F,6,0)),\"\",VLOOKUP(CONCATENATE($B31,\"-\",O$1),'База выдачи'!$A:$F,6,0)),VLOOKUP(CONCATENATE($B31,\"-\",O$1),База!$A:$G,6,0))","v":"02:38:11.370"},1,{"$f":"IF(ISERROR(VLOOKUP(CONCATENATE($B31,\"-\",R$1),База!$A:$G,5,0)),IF(ISERROR(VLOOKUP(CONCATENATE($B31,\"-\",R$1),'База выдачи'!$A:$F,5,0)),\"\",VLOOKUP(CONCATENATE($B31,\"-\",R$1),'База выдачи'!$A:$F,5,0)),VLOOKUP(CONCATENATE($B31,\"-\",R$1),База!$A:$G,5,0))","v":"ST"},{"$f":"IF(ISERROR(VLOOKUP(CONCATENATE($B31,\"-\",R$1),База!$A:$G,6,0)),IF(ISERROR(VLOOKUP(CONCATENATE($B31,\"-\",R$1),'База выдачи'!$A:$F,6,0)),\"\",VLOOKUP(CONCATENATE($B31,\"-\",R$1),'База выдачи'!$A:$F,6,0)),VLOOKUP(CONCATENATE($B31,\"-\",R$1),База!$A:$G,6,0))","v":"02:38:13.240"},3,{"$f":"IF(ISERROR(VLOOKUP(CONCATENATE($B31,\"-\",U$1),База!$A:$G,5,0)),IF(ISERROR(VLOOKUP(CONCATENATE($B31,\"-\",U$1),'База выдачи'!$A:$F,5,0)),\"\",VLOOKUP(CONCATENATE($B31,\"-\",U$1),'База выдачи'!$A:$F,5,0)),VLOOKUP(CONCATENATE($B31,\"-\",U$1),База!$A:$G,5,0))","v":""},{"$f":"IF(ISERROR(VLOOKUP(CONCATENATE($B31,\"-\",U$1),База!$A:$G,6,0)),IF(ISERROR(VLOOKUP(CONCATENATE($B31,\"-\",U$1),'База выдачи'!$A:$F,6,0)),\"\",VLOOKUP(CONCATENATE($B31,\"-\",U$1),'База выдачи'!$A:$F,6,0)),VLOOKUP(CONCATENATE($B31,\"-\",U$1),База!$A:$G,6,0))","v":""},7,{"$f":"IF(ISERROR(VLOOKUP(CONCATENATE($B31,\"-\",X$1),База!$A:$G,5,0)),IF(ISERROR(VLOOKUP(CONCATENATE($B31,\"-\",X$1),'База выдачи'!$A:$F,5,0)),\"\",VLOOKUP(CONCATENATE($B31,\"-\",X$1),'База выдачи'!$A:$F,5,0)),VLOOKUP(CONCATENATE($B31,\"-\",X$1),База!$A:$G,5,0))","v":""},{"$f":"IF(ISERROR(VLOOKUP(CONCATENATE($B31,\"-\",X$1),База!$A:$G,6,0)),IF(ISERROR(VLOOKUP(CONCATENATE($B31,\"-\",X$1),'База выдачи'!$A:$F,6,0)),\"\",VLOOKUP(CONCATENATE($B31,\"-\",X$1),'База выдачи'!$A:$F,6,0)),VLOOKUP(CONCATENATE($B31,\"-\",X$1),База!$A:$G,6,0))","v":""},5,{"$f":"IF(ISERROR(VLOOKUP(CONCATENATE($B31,\"-\",AA$1),База!$A:$G,5,0)),IF(ISERROR(VLOOKUP(CONCATENATE($B31,\"-\",AA$1),'База выдачи'!$A:$F,5,0)),\"\",VLOOKUP(CONCATENATE($B31,\"-\",AA$1),'База выдачи'!$A:$F,5,0)),VLOOKUP(CONCATENATE($B31,\"-\",AA$1),База!$A:$G,5,0))","v":""},{"$f":"IF(ISERROR(VLOOKUP(CONCATENATE($B31,\"-\",AA$1),База!$A:$G,6,0)),IF(ISERROR(VLOOKUP(CONCATENATE($B31,\"-\",AA$1),'База выдачи'!$A:$F,6,0)),\"\",VLOOKUP(CONCATENATE($B31,\"-\",AA$1),'База выдачи'!$A:$F,6,0)),VLOOKUP(CONCATENATE($B31,\"-\",AA$1),База!$A:$G,6,0))","v":""},"L",{"$f":"IF(ISERROR(VLOOKUP(CONCATENATE($B31,\"-\",AD$1),База!$A:$G,5,0)),IF(ISERROR(VLOOKUP(CONCATENATE($B31,\"-\",AD$1),'База выдачи'!$A:$F,5,0)),\"\",VLOOKUP(CONCATENATE($B31,\"-\",AD$1),'База выдачи'!$A:$F,5,0)),VLOOKUP(CONCATENATE($B31,\"-\",AD$1),База!$A:$G,5,0))","v":""},{"$f":"IF(ISERROR(VLOOKUP(CONCATENATE($B31,\"-\",AD$1),База!$A:$G,6,0)),IF(ISERROR(VLOOKUP(CONCATENATE($B31,\"-\",AD$1),'База выдачи'!$A:$F,6,0)),\"\",VLOOKUP(CONCATENATE($B31,\"-\",AD$1),'База выдачи'!$A:$F,6,0)),VLOOKUP(CONCATENATE($B31,\"-\",AD$1),База!$A:$G,6,0))","v":""},"M",{"$f":"IF(ISERROR(VLOOKUP(CONCATENATE($B31,\"-\",AG$1),База!$A:$G,5,0)),IF(ISERROR(VLOOKUP(CONCATENATE($B31,\"-\",AG$1),'База выдачи'!$A:$F,5,0)),\"\",VLOOKUP(CONCATENATE($B31,\"-\",AG$1),'База выдачи'!$A:$F,5,0)),VLOOKUP(CONCATENATE($B31,\"-\",AG$1),База!$A:$G,5,0))","v":""},{"$f":"IF(ISERROR(VLOOKUP(CONCATENATE($B31,\"-\",AG$1),База!$A:$G,6,0)),IF(ISERROR(VLOOKUP(CONCATENATE($B31,\"-\",AG$1),'База выдачи'!$A:$F,6,0)),\"\",VLOOKUP(CONCATENATE($B31,\"-\",AG$1),'База выдачи'!$A:$F,6,0)),VLOOKUP(CONCATENATE($B31,\"-\",AG$1),База!$A:$G,6,0))","v":""},"N",{"$f":"IF(ISERROR(VLOOKUP(CONCATENATE($B31,\"-\",AJ$1),База!$A:$G,5,0)),IF(ISERROR(VLOOKUP(CONCATENATE($B31,\"-\",AJ$1),'База выдачи'!$A:$F,5,0)),\"\",VLOOKUP(CONCATENATE($B31,\"-\",AJ$1),'База выдачи'!$A:$F,5,0)),VLOOKUP(CONCATENATE($B31,\"-\",AJ$1),База!$A:$G,5,0))","v":""},{"$f":"IF(ISERROR(VLOOKUP(CONCATENATE($B31,\"-\",AJ$1),База!$A:$G,6,0)),IF(ISERROR(VLOOKUP(CONCATENATE($B31,\"-\",AJ$1),'База выдачи'!$A:$F,6,0)),\"\",VLOOKUP(CONCATENATE($B31,\"-\",AJ$1),'База выдачи'!$A:$F,6,0)),VLOOKUP(CONCATENATE($B31,\"-\",AJ$1),База!$A:$G,6,0))","v":""},"O",{"$f":"IF(ISERROR(VLOOKUP(CONCATENATE($B31,\"-\",AM$1),База!$A:$G,5,0)),IF(ISERROR(VLOOKUP(CONCATENATE($B31,\"-\",AM$1),'База выдачи'!$A:$F,5,0)),\"\",VLOOKUP(CONCATENATE($B31,\"-\",AM$1),'База выдачи'!$A:$F,5,0)),VLOOKUP(CONCATENATE($B31,\"-\",AM$1),База!$A:$G,5,0))","v":""},{"$f":"IF(ISERROR(VLOOKUP(CONCATENATE($B31,\"-\",AM$1),База!$A:$G,6,0)),IF(ISERROR(VLOOKUP(CONCATENATE($B31,\"-\",AM$1),'База выдачи'!$A:$F,6,0)),\"\",VLOOKUP(CONCATENATE($B31,\"-\",AM$1),'База выдачи'!$A:$F,6,0)),VLOOKUP(CONCATENATE($B31,\"-\",AM$1),База!$A:$G,6,0))","v":""},"A",{"$f":"IF(ISERROR(VLOOKUP(CONCATENATE($B31,\"-\",AP$1),База!$A:$G,5,0)),IF(ISERROR(VLOOKUP(CONCATENATE($B31,\"-\",AP$1),'База выдачи'!$A:$F,5,0)),\"\",VLOOKUP(CONCATENATE($B31,\"-\",AP$1),'База выдачи'!$A:$F,5,0)),VLOOKUP(CONCATENATE($B31,\"-\",AP$1),База!$A:$G,5,0))","v":""},{"$f":"IF(ISERROR(VLOOKUP(CONCATENATE($B31,\"-\",AP$1),База!$A:$G,6,0)),IF(ISERROR(VLOOKUP(CONCATENATE($B31,\"-\",AP$1),'База выдачи'!$A:$F,6,0)),\"\",VLOOKUP(CONCATENATE($B31,\"-\",AP$1),'База выдачи'!$A:$F,6,0)),VLOOKUP(CONCATENATE($B31,\"-\",AP$1),База!$A:$G,6,0))","v":""},"B",{"$f":"IF(ISERROR(VLOOKUP(CONCATENATE($B31,\"-\",AS$1),База!$A:$G,5,0)),IF(ISERROR(VLOOKUP(CONCATENATE($B31,\"-\",AS$1),'База выдачи'!$A:$F,5,0)),\"\",VLOOKUP(CONCATENATE($B31,\"-\",AS$1),'База выдачи'!$A:$F,5,0)),VLOOKUP(CONCATENATE($B31,\"-\",AS$1),База!$A:$G,5,0))","v":""},{"$f":"IF(ISERROR(VLOOKUP(CONCATENATE($B31,\"-\",AS$1),База!$A:$G,6,0)),IF(ISERROR(VLOOKUP(CONCATENATE($B31,\"-\",AS$1),'База выдачи'!$A:$F,6,0)),\"\",VLOOKUP(CONCATENATE($B31,\"-\",AS$1),'База выдачи'!$A:$F,6,0)),VLOOKUP(CONCATENATE($B31,\"-\",AS$1),База!$A:$G,6,0))","v":""},null,null,{"$f":"COUNTIFS(База!B:B,Статистика!B31,База!E:E,\"OK\")","v":4},{"$f":"DK3","v":"02:38:11.370"},9491,{"$f":"COUNTIFS(База!B:B,Статистика!B31,База!E:E,\"XXXX\")","v":1},{"$f":"IF(AX31+AZ31+BA31=0,ксекундвигре-BD31,ксекундвигре*Статистика!AX31+(ксекундвигре-Статистика!AZ31)+Статистика!BA31)","v":44810},34549,29,14]
[30,{"$f":"IF(ISERROR(VLOOKUP(A32,Служебный!B:C,2,0)),\"\",A32&\"-\"&VLOOKUP(A32,Служебный!B:C,2,0))","v":"30-АРАБЕЛЛА"},3,{"$f":"IF(ISERROR(VLOOKUP(CONCATENATE($B32,\"-\",C$1),База!$A:$G,5,0)),IF(ISERROR(VLOOKUP(CONCATENATE($B32,\"-\",C$1),'База выдачи'!$A:$F,5,0)),\"\",VLOOKUP(CONCATENATE($B32,\"-\",C$1),'База выдачи'!$A:$F,5,0)),VLOOKUP(CONCATENATE($B32,\"-\",C$1),База!$A:$G,5,0))","v":"OK"},{"$f":"IF(ISERROR(VLOOKUP(CONCATENATE($B32,\"-\",C$1),База!$A:$G,6,0)),IF(ISERROR(VLOOKUP(CONCATENATE($B32,\"-\",C$1),'База выдачи'!$A:$F,6,0)),\"\",VLOOKUP(CONCATENATE($B32,\"-\",C$1),'База выдачи'!$A:$F,6,0)),VLOOKUP(CONCATENATE($B32,\"-\",C$1),База!$A:$G,6,0))","v":"00:30:42.910"},5,{"$f":"IF(ISERROR(VLOOKUP(CONCATENATE($B32,\"-\",F$1),База!$A:$G,5,0)),IF(ISERROR(VLOOKUP(CONCATENATE($B32,\"-\",F$1),'База выдачи'!$A:$F,5,0)),\"\",VLOOKUP(CONCATENATE($B32,\"-\",F$1),'База выдачи'!$A:$F,5,0)),VLOOKUP(CONCATENATE($B32,\"-\",F$1),База!$A:$G,5,0))","v":"OK"},{"$f":"IF(ISERROR(VLOOKUP(CONCATENATE($B32,\"-\",F$1),База!$A:$G,6,0)),IF(ISERROR(VLOOKUP(CONCATENATE($B32,\"-\",F$1),'База выдачи'!$A:$F,6,0)),\"\",VLOOKUP(CONCATENATE($B32,\"-\",F$1),'База выдачи'!$A:$F,6,0)),VLOOKUP(CONCATENATE($B32,\"-\",F$1),База!$A:$G,6,0))","v":"01:03:36.220"},7,{"$f":"IF(ISERROR(VLOOKUP(CONCATENATE($B32,\"-\",I$1),База!$A:$G,5,0)),IF(ISERROR(VLOOKUP(CONCATENATE($B32,\"-\",I$1),'База выдачи'!$A:$F,5,0)),\"\",VLOOKUP(CONCATENATE($B32,\"-\",I$1),'База выдачи'!$A:$F,5,0)),VLOOKUP(CONCATENATE($B32,\"-\",I$1),База!$A:$G,5,0))","v":"OK"},{"$f":"IF(ISERROR(VLOOKUP(CONCATENATE($B32,\"-\",I$1),База!$A:$G,6,0)),IF(ISERROR(VLOOKUP(CONCATENATE($B32,\"-\",I$1),'База выдачи'!$A:$F,6,0)),\"\",VLOOKUP(CONCATENATE($B32,\"-\",I$1),'База выдачи'!$A:$F,6,0)),VLOOKUP(CONCATENATE($B32,\"-\",I$1),База!$A:$G,6,0))","v":"01:17:17.420"},9,{"$f":"IF(ISERROR(VLOOKUP(CONCATENATE($B32,\"-\",L$1),База!$A:$G,5,0)),IF(ISERROR(VLOOKUP(CONCATENATE($B32,\"-\",L$1),'База выдачи'!$A:$F,5,0)),\"\",VLOOKUP(CONCATENATE($B32,\"-\",L$1),'База выдачи'!$A:$F,5,0)),VLOOKUP(CONCATENATE($B32,\"-\",L$1),База!$A:$G,5,0))","v":"OK"},{"$f":"IF(ISERROR(VLOOKUP(CONCATENATE($B32,\"-\",L$1),База!$A:$G,6,0)),IF(ISERROR(VLOOKUP(CONCATENATE($B32,\"-\",L$1),'База выдачи'!$A:$F,6,0)),\"\",VLOOKUP(CONCATENATE($B32,\"-\",L$1),'База выдачи'!$A:$F,6,0)),VLOOKUP(CONCATENATE($B32,\"-\",L$1),База!$A:$G,6,0))","v":"01:55:25.220"},1,{"$f":"IF(ISERROR(VLOOKUP(CONCATENATE($B32,\"-\",O$1),База!$A:$G,5,0)),IF(ISERROR(VLOOKUP(CONCATENATE($B32,\"-\",O$1),'База выдачи'!$A:$F,5,0)),\"\",VLOOKUP(CONCATENATE($B32,\"-\",O$1),'База выдачи'!$A:$F,5,0)),VLOOKUP(CONCATENATE($B32,\"-\",O$1),База!$A:$G,5,0))","v":"OK"},{"$f":"IF(ISERROR(VLOOKUP(CONCATENATE($B32,\"-\",O$1),База!$A:$G,6,0)),IF(ISERROR(VLOOKUP(CONCATENATE($B32,\"-\",O$1),'База выдачи'!$A:$F,6,0)),\"\",VLOOKUP(CONCATENATE($B32,\"-\",O$1),'База выдачи'!$A:$F,6,0)),VLOOKUP(CONCATENATE($B32,\"-\",O$1),База!$A:$G,6,0))","v":"02:47:12.380"},2,{"$f":"IF(ISERROR(VLOOKUP(CONCATENATE($B32,\"-\",R$1),База!$A:$G,5,0)),IF(ISERROR(VLOOKUP(CONCATENATE($B32,\"-\",R$1),'База выдачи'!$A:$F,5,0)),\"\",VLOOKUP(CONCATENATE($B32,\"-\",R$1),'База выдачи'!$A:$F,5,0)),VLOOKUP(CONCATENATE($B32,\"-\",R$1),База!$A:$G,5,0))","v":"OK"},{"$f":"IF(ISERROR(VLOOKUP(CONCATENATE($B32,\"-\",R$1),База!$A:$G,6,0)),IF(ISERROR(VLOOKUP(CONCATENATE($B32,\"-\",R$1),'База выдачи'!$A:$F,6,0)),\"\",VLOOKUP(CONCATENATE($B32,\"-\",R$1),'База выдачи'!$A:$F,6,0)),VLOOKUP(CONCATENATE($B32,\"-\",R$1),База!$A:$G,6,0))","v":"02:59:43.410"},4,{"$f":"IF(ISERROR(VLOOKUP(CONCATENATE($B32,\"-\",U$1),База!$A:$G,5,0)),IF(ISERROR(VLOOKUP(CONCATENATE($B32,\"-\",U$1),'База выдачи'!$A:$F,5,0)),\"\",VLOOKUP(CONCATENATE($B32,\"-\",U$1),'База выдачи'!$A:$F,5,0)),VLOOKUP(CONCATENATE($B32,\"-\",U$1),База!$A:$G,5,0))","v":"ST"},{"$f":"IF(ISERROR(VLOOKUP(CONCATENATE($B32,\"-\",U$1),База!$A:$G,6,0)),IF(ISERROR(VLOOKUP(CONCATENATE($B32,\"-\",U$1),'База выдачи'!$A:$F,6,0)),\"\",VLOOKUP(CONCATENATE($B32,\"-\",U$1),'База выдачи'!$A:$F,6,0)),VLOOKUP(CONCATENATE($B32,\"-\",U$1),База!$A:$G,6,0))","v":"02:59:45.330"},8,{"$f":"IF(ISERROR(VLOOKUP(CONCATENATE($B32,\"-\",X$1),База!$A:$G,5,0)),IF(ISERROR(VLOOKUP(CONCATENATE($B32,\"-\",X$1),'База выдачи'!$A:$F,5,0)),\"\",VLOOKUP(CONCATENATE($B32,\"-\",X$1),'База выдачи'!$A:$F,5,0)),VLOOKUP(CONCATENATE($B32,\"-\",X$1),База!$A:$G,5,0))","v":""},{"$f":"IF(ISERROR(VLOOKUP(CONCATENATE($B32,\"-\",X$1),База!$A:$G,6,0)),IF(ISERROR(VLOOKUP(CONCATENATE($B32,\"-\",X$1),'База выдачи'!$A:$F,6,0)),\"\",VLOOKUP(CONCATENATE($B32,\"-\",X$1),'База выдачи'!$A:$F,6,0)),VLOOKUP(CONCATENATE($B32,\"-\",X$1),База!$A:$G,6,0))","v":""},6,{"$f":"IF(ISERROR(VLOOKUP(CONCATENATE($B32,\"-\",AA$1),База!$A:$G,5,0)),IF(ISERROR(VLOOKUP(CONCATENATE($B32,\"-\",AA$1),'База выдачи'!$A:$F,5,0)),\"\",VLOOKUP(CONCATENATE($B32,\"-\",AA$1),'База выдачи'!$A:$F,5,0)),VLOOKUP(CONCATENATE($B32,\"-\",AA$1),База!$A:$G,5,0))","v":""},{"$f":"IF(ISERROR(VLOOKUP(CONCATENATE($B32,\"-\",AA$1),База!$A:$G,6,0)),IF(ISERROR(VLOOKUP(CONCATENATE($B32,\"-\",AA$1),'База выдачи'!$A:$F,6,0)),\"\",VLOOKUP(CONCATENATE($B32,\"-\",AA$1),'База выдачи'!$A:$F,6,0)),VLOOKUP(CONCATENATE($B32,\"-\",AA$1),База!$A:$G,6,0))","v":""},"K",{"$f":"IF(ISERROR(VLOOKUP(CONCATENATE($B32,\"-\",AD$1),База!$A:$G,5,0)),IF(ISERROR(VLOOKUP(CONCATENATE($B32,\"-\",AD$1),'База выдачи'!$A:$F,5,0)),\"\",VLOOKUP(CONCATENATE($B32,\"-\",AD$1),'База выдачи'!$A:$F,5,0)),VLOOKUP(CONCATENATE($B32,\"-\",AD$1),База!$A:$G,5,0))","v":""},{"$f":"IF(ISERROR(VLOOKUP(CONCATENATE($B32,\"-\",AD$1),База!$A:$G,6,0)),IF(ISERROR(VLOOKUP(CONCATENATE($B32,\"-\",AD$1),'База выдачи'!$A:$F,6,0)),\"\",VLOOKUP(CONCATENATE($B32,\"-\",AD$1),'База выдачи'!$A:$F,6,0)),VLOOKUP(CONCATENATE($B32,\"-\",AD$1),База!$A:$G,6,0))","v":""},"L",{"$f":"IF(ISERROR(VLOOKUP(CONCATENATE($B32,\"-\",AG$1),База!$A:$G,5,0)),IF(ISERROR(VLOOKUP(CONCATENATE($B32,\"-\",AG$1),'База выдачи'!$A:$F,5,0)),\"\",VLOOKUP(CONCATENATE($B32,\"-\",AG$1),'База выдачи'!$A:$F,5,0)),VLOOKUP(CONCATENATE($B32,\"-\",AG$1),База!$A:$G,5,0))","v":""},{"$f":"IF(ISERROR(VLOOKUP(CONCATENATE($B32,\"-\",AG$1),База!$A:$G,6,0)),IF(ISERROR(VLOOKUP(CONCATENATE($B32,\"-\",AG$1),'База выдачи'!$A:$F,6,0)),\"\",VLOOKUP(CONCATENATE($B32,\"-\",AG$1),'База выдачи'!$A:$F,6,0)),VLOOKUP(CONCATENATE($B32,\"-\",AG$1),База!$A:$G,6,0))","v":""},"M",{"$f":"IF(ISERROR(VLOOKUP(CONCATENATE($B32,\"-\",AJ$1),База!$A:$G,5,0)),IF(ISERROR(VLOOKUP(CONCATENATE($B32,\"-\",AJ$1),'База выдачи'!$A:$F,5,0)),\"\",VLOOKUP(CONCATENATE($B32,\"-\",AJ$1),'База выдачи'!$A:$F,5,0)),VLOOKUP(CONCATENATE($B32,\"-\",AJ$1),База!$A:$G,5,0))","v":""},{"$f":"IF(ISERROR(VLOOKUP(CONCATENATE($B32,\"-\",AJ$1),База!$A:$G,6,0)),IF(ISERROR(VLOOKUP(CONCATENATE($B32,\"-\",AJ$1),'База выдачи'!$A:$F,6,0)),\"\",VLOOKUP(CONCATENATE($B32,\"-\",AJ$1),'База выдачи'!$A:$F,6,0)),VLOOKUP(CONCATENATE($B32,\"-\",AJ$1),База!$A:$G,6,0))","v":""},"N",{"$f":"IF(ISERROR(VLOOKUP(CONCATENATE($B32,\"-\",AM$1),База!$A:$G,5,0)),IF(ISERROR(VLOOKUP(CONCATENATE($B32,\"-\",AM$1),'База выдачи'!$A:$F,5,0)),\"\",VLOOKUP(CONCATENATE($B32,\"-\",AM$1),'База выдачи'!$A:$F,5,0)),VLOOKUP(CONCATENATE($B32,\"-\",AM$1),База!$A:$G,5,0))","v":""},{"$f":"IF(ISERROR(VLOOKUP(CONCATENATE($B32,\"-\",AM$1),База!$A:$G,6,0)),IF(ISERROR(VLOOKUP(CONCATENATE($B32,\"-\",AM$1),'База выдачи'!$A:$F,6,0)),\"\",VLOOKUP(CONCATENATE($B32,\"-\",AM$1),'База выдачи'!$A:$F,6,0)),VLOOKUP(CONCATENATE($B32,\"-\",AM$1),База!$A:$G,6,0))","v":""},"O",{"$f":"IF(ISERROR(VLOOKUP(CONCATENATE($B32,\"-\",AP$1),База!$A:$G,5,0)),IF(ISERROR(VLOOKUP(CONCATENATE($B32,\"-\",AP$1),'База выдачи'!$A:$F,5,0)),\"\",VLOOKUP(CONCATENATE($B32,\"-\",AP$1),'База выдачи'!$A:$F,5,0)),VLOOKUP(CONCATENATE($B32,\"-\",AP$1),База!$A:$G,5,0))","v":""},{"$f":"IF(ISERROR(VLOOKUP(CONCATENATE($B32,\"-\",AP$1),База!$A:$G,6,0)),IF(ISERROR(VLOOKUP(CONCATENATE($B32,\"-\",AP$1),'База выдачи'!$A:$F,6,0)),\"\",VLOOKUP(CONCATENATE($B32,\"-\",AP$1),'База выдачи'!$A:$F,6,0)),VLOOKUP(CONCATENATE($B32,\"-\",AP$1),База!$A:$G,6,0))","v":""},"A",{"$f":"IF(ISERROR(VLOOKUP(CONCATENATE($B32,\"-\",AS$1),База!$A:$G,5,0)),IF(ISERROR(VLOOKUP(CONCATENATE($B32,\"-\",AS$1),'База выдачи'!$A:$F,5,0)),\"\",VLOOKUP(CONCATENATE($B32,\"-\",AS$1),'База выдачи'!$A:$F,5,0)),VLOOKUP(CONCATENATE($B32,\"-\",AS$1),База!$A:$G,5,0))","v":""},{"$f":"IF(ISERROR(VLOOKUP(CONCATENATE($B32,\"-\",AS$1),База!$A:$G,6,0)),IF(ISERROR(VLOOKUP(CONCATENATE($B32,\"-\",AS$1),'База выдачи'!$A:$F,6,0)),\"\",VLOOKUP(CONCATENATE($B32,\"-\",AS$1),'База выдачи'!$A:$F,6,0)),VLOOKUP(CONCATENATE($B32,\"-\",AS$1),База!$A:$G,6,0))","v":""},null,null,{"$f":"COUNTIFS(База!B:B,Статистика!B32,База!E:E,\"OK\")","v":6},{"$f":"DM3","v":"02:59:43.410"},10783,{"$f":"COUNTIFS(База!B:B,Статистика!B32,База!E:E,\"XXXX\")","v":0},{"$f":"IF(AX32+AZ32+BA32=0,ксекундвигре-BD32,ксекундвигре*Статистика!AX32+(ксекундвигре-Статистика!AZ32)+Статистика!BA32)","v":65237},32817,30,3]
[31,{"$f":"IF(ISERROR(VLOOKUP(A33,Служебный!B:C,2,0)),\"\",A33&\"-\"&VLOOKUP(A33,Служебный!B:C,2,0))","v":""},4,{"$f":"IF(ISERROR(VLOOKUP(CONCATENATE($B33,\"-\",C$1),База!$A:$G,5,0)),IF(ISERROR(VLOOKUP(CONCATENATE($B33,\"-\",C$1),'База выдачи'!$A:$F,5,0)),\"\",VLOOKUP(CONCATENATE($B33,\"-\",C$1),'База выдачи'!$A:$F,5,0)),VLOOKUP(CONCATENATE($B33,\"-\",C$1),База!$A:$G,5,0))","v":""},{"$f":"IF(ISERROR(VLOOKUP(CONCATENATE($B33,\"-\",C$1),База!$A:$G,6,0)),IF(ISERROR(VLOOKUP(CONCATENATE($B33,\"-\",C$1),'База выдачи'!$A:$F,6,0)),\"\",VLOOKUP(CONCATENATE($B33,\"-\",C$1),'База выдачи'!$A:$F,6,0)),VLOOKUP(CONCATENATE($B33,\"-\",C$1),База!$A:$G,6,0))","v":""},2,{"$f":"IF(ISERROR(VLOOKUP(CONCATENATE($B33,\"-\",F$1),База!$A:$G,5,0)),IF(ISERROR(VLOOKUP(CONCATENATE($B33,\"-\",F$1),'База выдачи'!$A:$F,5,0)),\"\",VLOOKUP(CONCATENATE($B33,\"-\",F$1),'База выдачи'!$A:$F,5,0)),VLOOKUP(CONCATENATE($B33,\"-\",F$1),База!$A:$G,5,0))","v":""},{"$f":"IF(ISERROR(VLOOKUP(CONCATENATE($B33,\"-\",F$1),База!$A:$G,6,0)),IF(ISERROR(VLOOKUP(CONCATENATE($B33,\"-\",F$1),'База выдачи'!$A:$F,6,0)),\"\",VLOOKUP(CONCATENATE($B33,\"-\",F$1),'База выдачи'!$A:$F,6,0)),VLOOKUP(CONCATENATE($B33,\"-\",F$1),База!$A:$G,6,0))","v":""},3,{"$f":"IF(ISERROR(VLOOKUP(CONCATENATE($B33,\"-\",I$1),База!$A:$G,5,0)),IF(ISERROR(VLOOKUP(CONCATENATE($B33,\"-\",I$1),'База выдачи'!$A:$F,5,0)),\"\",VLOOKUP(CONCATENATE($B33,\"-\",I$1),'База выдачи'!$A:$F,5,0)),VLOOKUP(CONCATENATE($B33,\"-\",I$1),База!$A:$G,5,0))","v":""},{"$f":"IF(ISERROR(VLOOKUP(CONCATENATE($B33,\"-\",I$1),База!$A:$G,6,0)),IF(ISERROR(VLOOKUP(CONCATENATE($B33,\"-\",I$1),'База выдачи'!$A:$F,6,0)),\"\",VLOOKUP(CONCATENATE($B33,\"-\",I$1),'База выдачи'!$A:$F,6,0)),VLOOKUP(CONCATENATE($B33,\"-\",I$1),База!$A:$G,6,0))","v":""},5,{"$f":"IF(ISERROR(VLOOKUP(CONCATENATE($B33,\"-\",L$1),База!$A:$G,5,0)),IF(ISERROR(VLOOKUP(CONCATENATE($B33,\"-\",L$1),'База выдачи'!$A:$F,5,0)),\"\",VLOOKUP(CONCATENATE($B33,\"-\",L$1),'База выдачи'!$A:$F,5,0)),VLOOKUP(CONCATENATE($B33,\"-\",L$1),База!$A:$G,5,0))","v":""},{"$f":"IF(ISERROR(VLOOKUP(CONCATENATE($B33,\"-\",L$1),База!$A:$G,6,0)),IF(ISERROR(VLOOKUP(CONCATENATE($B33,\"-\",L$1),'База выдачи'!$A:$F,6,0)),\"\",VLOOKUP(CONCATENATE($B33,\"-\",L$1),'База выдачи'!$A:$F,6,0)),VLOOKUP(CONCATENATE($B33,\"-\",L$1),База!$A:$G,6,0))","v":""},8,{"$f":"IF(ISERROR(VLOOKUP(CONCATENATE($B33,\"-\",O$1),База!$A:$G,5,0)),IF(ISERROR(VLOOKUP(CONCATENATE($B33,\"-\",O$1),'База выдачи'!$A:$F,5,0)),\"\",VLOOKUP(CONCATENATE($B33,\"-\",O$1),'База выдачи'!$A:$F,5,0)),VLOOKUP(CONCATENATE($B33,\"-\",O$1),База!$A:$G,5,0))","v":""},{"$f":"IF(ISERROR(VLOOKUP(CONCATENATE($B33,\"-\",O$1),База!$A:$G,6,0)),IF(ISERROR(VLOOKUP(CONCATENATE($B33,\"-\",O$1),'База выдачи'!$A:$F,6,0)),\"\",VLOOKUP(CONCATENATE($B33,\"-\",O$1),'База выдачи'!$A:$F,6,0)),VLOOKUP(CONCATENATE($B33,\"-\",O$1),База!$A:$G,6,0))","v":""},9,{"$f":"IF(ISERROR(VLOOKUP(CONCATENATE($B33,\"-\",R$1),База!$A:$G,5,0)),IF(ISERROR(VLOOKUP(CONCATENATE($B33,\"-\",R$1),'База выдачи'!$A:$F,5,0)),\"\",VLOOKUP(CONCATENATE($B33,\"-\",R$1),'База выдачи'!$A:$F,5,0)),VLOOKUP(CONCATENATE($B33,\"-\",R$1),База!$A:$G,5,0))","v":""},{"$f":"IF(ISERROR(VLOOKUP(CONCATENATE($B33,\"-\",R$1),База!$A:$G,6,0)),IF(ISERROR(VLOOKUP(CONCATENATE($B33,\"-\",R$1),'База выдачи'!$A:$F,6,0)),\"\",VLOOKUP(CONCATENATE($B33,\"-\",R$1),'База выдачи'!$A:$F,6,0)),VLOOKUP(CONCATENATE($B33,\"-\",R$1),База!$A:$G,6,0))","v":""},7,{"$f":"IF(ISERROR(VLOOKUP(CONCATENATE($B33,\"-\",U$1),База!$A:$G,5,0)),IF(ISERROR(VLOOKUP(CONCATENATE($B33,\"-\",U$1),'База выдачи'!$A:$F,5,0)),\"\",VLOOKUP(CONCATENATE($B33,\"-\",U$1),'База выдачи'!$A:$F,5,0)),VLOOKUP(CONCATENATE($B33,\"-\",U$1),База!$A:$G,5,0))","v":""},{"$f":"IF(ISERROR(VLOOKUP(CONCATENATE($B33,\"-\",U$1),База!$A:$G,6,0)),IF(ISERROR(VLOOKUP(CONCATENATE($B33,\"-\",U$1),'База выдачи'!$A:$F,6,0)),\"\",VLOOKUP(CONCATENATE($B33,\"-\",U$1),'База выдачи'!$A:$F,6,0)),VLOOKUP(CONCATENATE($B33,\"-\",U$1),База!$A:$G,6,0))","v":""},6,{"$f":"IF(ISERROR(VLOOKUP(CONCATENATE($B33,\"-\",X$1),База!$A:$G,5,0)),IF(ISERROR(VLOOKUP(CONCATENATE($B33,\"-\",X$1),'База выдачи'!$A:$F,5,0)),\"\",VLOOKUP(CONCATENATE($B33,\"-\",X$1),'База выдачи'!$A:$F,5,0)),VLOOKUP(CONCATENATE($B33,\"-\",X$1),База!$A:$G,5,0))","v":""},{"$f":"IF(ISERROR(VLOOKUP(CONCATENATE($B33,\"-\",X$1),База!$A:$G,6,0)),IF(ISERROR(VLOOKUP(CONCATENATE($B33,\"-\",X$1),'База выдачи'!$A:$F,6,0)),\"\",VLOOKUP(CONCATENATE($B33,\"-\",X$1),'База выдачи'!$A:$F,6,0)),VLOOKUP(CONCATENATE($B33,\"-\",X$1),База!$A:$G,6,0))","v":""},1,{"$f":"IF(ISERROR(VLOOKUP(CONCATENATE($B33,\"-\",AA$1),База!$A:$G,5,0)),IF(ISERROR(VLOOKUP(CONCATENATE($B33,\"-\",AA$1),'База выдачи'!$A:$F,5,0)),\"\",VLOOKUP(CONCATENATE($B33,\"-\",AA$1),'База выдачи'!$A:$F,5,0)),VLOOKUP(CONCATENATE($B33,\"-\",AA$1),База!$A:$G,5,0))","v":""},{"$f":"IF(ISERROR(VLOOKUP(CONCATENATE($B33,\"-\",AA$1),База!$A:$G,6,0)),IF(ISERROR(VLOOKUP(CONCATENATE($B33,\"-\",AA$1),'База выдачи'!$A:$F,6,0)),\"\",VLOOKUP(CONCATENATE($B33,\"-\",AA$1),'База выдачи'!$A:$F,6,0)),VLOOKUP(CONCATENATE($B33,\"-\",AA$1),База!$A:$G,6,0))","v":""},"J",{"$f":"IF(ISERROR(VLOOKUP(CONCATENATE($B33,\"-\",AD$1),База!$A:$G,5,0)),IF(ISERROR(VLOOKUP(CONCATENATE($B33,\"-\",AD$1),'База выдачи'!$A:$F,5,0)),\"\",VLOOKUP(CONCATENATE($B33,\"-\",AD$1),'База выдачи'!$A:$F,5,0)),VLOOKUP(CONCATENATE($B33,\"-\",AD$1),База!$A:$G,5,0))","v":""},{"$f":"IF(ISERROR(VLOOKUP(CONCATENATE($B33,\"-\",AD$1),База!$A:$G,6,0)),IF(ISERROR(VLOOKUP(CONCATENATE($B33,\"-\",AD$1),'База выдачи'!$A:$F,6,0)),\"\",VLOOKUP(CONCATENATE($B33,\"-\",AD$1),'База выдачи'!$A:$F,6,0)),VLOOKUP(CONCATENATE($B33,\"-\",AD$1),База!$A:$G,6,0))","v":""},"K",{"$f":"IF(ISERROR(VLOOKUP(CONCATENATE($B33,\"-\",AG$1),База!$A:$G,5,0)),IF(ISERROR(VLOOKUP(CONCATENATE($B33,\"-\",AG$1),'База выдачи'!$A:$F,5,0)),\"\",VLOOKUP(CONCATENATE($B33,\"-\",AG$1),'База выдачи'!$A:$F,5,0)),VLOOKUP(CONCATENATE($B33,\"-\",AG$1),База!$A:$G,5,0))","v":""},{"$f":"IF(ISERROR(VLOOKUP(CONCATENATE($B33,\"-\",AG$1),База!$A:$G,6,0)),IF(ISERROR(VLOOKUP(CONCATENATE($B33,\"-\",AG$1),'База выдачи'!$A:$F,6,0)),\"\",VLOOKUP(CONCATENATE($B33,\"-\",AG$1),'База выдачи'!$A:$F,6,0)),VLOOKUP(CONCATENATE($B33,\"-\",AG$1),База!$A:$G,6,0))","v":""},"L",{"$f":"IF(ISERROR(VLOOKUP(CONCATENATE($B33,\"-\",AJ$1),База!$A:$G,5,0)),IF(ISERROR(VLOOKUP(CONCATENATE($B33,\"-\",AJ$1),'База выдачи'!$A:$F,5,0)),\"\",VLOOKUP(CONCATENATE($B33,\"-\",AJ$1),'База выдачи'!$A:$F,5,0)),VLOOKUP(CONCATENATE($B33,\"-\",AJ$1),База!$A:$G,5,0))","v":""},{"$f":"IF(ISERROR(VLOOKUP(CONCATENATE($B33,\"-\",AJ$1),База!$A:$G,6,0)),IF(ISERROR(VLOOKUP(CONCATENATE($B33,\"-\",AJ$1),'База выдачи'!$A:$F,6,0)),\"\",VLOOKUP(CONCATENATE($B33,\"-\",AJ$1),'База выдачи'!$A:$F,6,0)),VLOOKUP(CONCATENATE($B33,\"-\",AJ$1),База!$A:$G,6,0))","v":""},"M",{"$f":"IF(ISERROR(VLOOKUP(CONCATENATE($B33,\"-\",AM$1),База!$A:$G,5,0)),IF(ISERROR(VLOOKUP(CONCATENATE($B33,\"-\",AM$1),'База выдачи'!$A:$F,5,0)),\"\",VLOOKUP(CONCATENATE($B33,\"-\",AM$1),'База выдачи'!$A:$F,5,0)),VLOOKUP(CONCATENATE($B33,\"-\",AM$1),База!$A:$G,5,0))","v":""},{"$f":"IF(ISERROR(VLOOKUP(CONCATENATE($B33,\"-\",AM$1),База!$A:$G,6,0)),IF(ISERROR(VLOOKUP(CONCATENATE($B33,\"-\",AM$1),'База выдачи'!$A:$F,6,0)),\"\",VLOOKUP(CONCATENATE($B33,\"-\",AM$1),'База выдачи'!$A:$F,6,0)),VLOOKUP(CONCATENATE($B33,\"-\",AM$1),База!$A:$G,6,0))","v":""},"N",{"$f":"IF(ISERROR(VLOOKUP(CONCATENATE($B33,\"-\",AP$1),База!$A:$G,5,0)),IF(ISERROR(VLOOKUP(CONCATENATE($B33,\"-\",AP$1),'База выдачи'!$A:$F,5,0)),\"\",VLOOKUP(CONCATENATE($B33,\"-\",AP$1),'База выдачи'!$A:$F,5,0)),VLOOKUP(CONCATENATE($B33,\"-\",AP$1),База!$A:$G,5,0))","v":""},{"$f":"IF(ISERROR(VLOOKUP(CONCATENATE($B33,\"-\",AP$1),База!$A:$G,6,0)),IF(ISERROR(VLOOKUP(CONCATENATE($B33,\"-\",AP$1),'База выдачи'!$A:$F,6,0)),\"\",VLOOKUP(CONCATENATE($B33,\"-\",AP$1),'База выдачи'!$A:$F,6,0)),VLOOKUP(CONCATENATE($B33,\"-\",AP$1),База!$A:$G,6,0))","v":""},"O",{"$f":"IF(ISERROR(VLOOKUP(CONCATENATE($B33,\"-\",AS$1),База!$A:$G,5,0)),IF(ISERROR(VLOOKUP(CONCATENATE($B33,\"-\",AS$1),'База выдачи'!$A:$F,5,0)),\"\",VLOOKUP(CONCATENATE($B33,\"-\",AS$1),'База выдачи'!$A:$F,5,0)),VLOOKUP(CONCATENATE($B33,\"-\",AS$1),База!$A:$G,5,0))","v":""},{"$f":"IF(ISERROR(VLOOKUP(CONCATENATE($B33,\"-\",AS$1),База!$A:$G,6,0)),IF(ISERROR(VLOOKUP(CONCATENATE($B33,\"-\",AS$1),'База выдачи'!$A:$F,6,0)),\"\",VLOOKUP(CONCATENATE($B33,\"-\",AS$1),'База выдачи'!$A:$F,6,0)),VLOOKUP(CONCATENATE($B33,\"-\",AS$1),База!$A:$G,6,0))","v":""},null,null,{"$f":"COUNTIFS(База!B:B,Статистика!B33,База!E:E,\"OK\")","v":0},{"$f":"DO3","v":"03:03:16.770"},10997,{"$f":"COUNTIFS(База!B:B,Статистика!B33,База!E:E,\"XXXX\")","v":0},{"$f":"IF(AX33+AZ33+BA33=0,ксекундвигре-BD33,ксекундвигре*Статистика!AX33+(ксекундвигре-Статистика!AZ33)+Статистика!BA33)","v":-137},-137,31,31]
[32,{"$f":"IF(ISERROR(VLOOKUP(A34,Служебный!B:C,2,0)),\"\",A34&\"-\"&VLOOKUP(A34,Служебный!B:C,2,0))","v":""},5,{"$f":"IF(ISERROR(VLOOKUP(CONCATENATE($B34,\"-\",C$1),База!$A:$G,5,0)),IF(ISERROR(VLOOKUP(CONCATENATE($B34,\"-\",C$1),'База выдачи'!$A:$F,5,0)),\"\",VLOOKUP(CONCATENATE($B34,\"-\",C$1),'База выдачи'!$A:$F,5,0)),VLOOKUP(CONCATENATE($B34,\"-\",C$1),База!$A:$G,5,0))","v":""},{"$f":"IF(ISERROR(VLOOKUP(CONCATENATE($B34,\"-\",C$1),База!$A:$G,6,0)),IF(ISERROR(VLOOKUP(CONCATENATE($B34,\"-\",C$1),'База выдачи'!$A:$F,6,0)),\"\",VLOOKUP(CONCATENATE($B34,\"-\",C$1),'База выдачи'!$A:$F,6,0)),VLOOKUP(CONCATENATE($B34,\"-\",C$1),База!$A:$G,6,0))","v":""},6,{"$f":"IF(ISERROR(VLOOKUP(CONCATENATE($B34,\"-\",F$1),База!$A:$G,5,0)),IF(ISERROR(VLOOKUP(CONCATENATE($B34,\"-\",F$1),'База выдачи'!$A:$F,5,0)),\"\",VLOOKUP(CONCATENATE($B34,\"-\",F$1),'База выдачи'!$A:$F,5,0)),VLOOKUP(CONCATENATE($B34,\"-\",F$1),База!$A:$G,5,0))","v":""},{"$f":"IF(ISERROR(VLOOKUP(CONCATENATE($B34,\"-\",F$1),База!$A:$G,6,0)),IF(ISERROR(VLOOKUP(CONCATENATE($B34,\"-\",F$1),'База выдачи'!$A:$F,6,0)),\"\",VLOOKUP(CONCATENATE($B34,\"-\",F$1),'База выдачи'!$A:$F,6,0)),VLOOKUP(CONCATENATE($B34,\"-\",F$1),База!$A:$G,6,0))","v":""},9,{"$f":"IF(ISERROR(VLOOKUP(CONCATENATE($B34,\"-\",I$1),База!$A:$G,5,0)),IF(ISERROR(VLOOKUP(CONCATENATE($B34,\"-\",I$1),'База выдачи'!$A:$F,5,0)),\"\",VLOOKUP(CONCATENATE($B34,\"-\",I$1),'База выдачи'!$A:$F,5,0)),VLOOKUP(CONCATENATE($B34,\"-\",I$1),База!$A:$G,5,0))","v":""},{"$f":"IF(ISERROR(VLOOKUP(CONCATENATE($B34,\"-\",I$1),База!$A:$G,6,0)),IF(ISERROR(VLOOKUP(CONCATENATE($B34,\"-\",I$1),'База выдачи'!$A:$F,6,0)),\"\",VLOOKUP(CONCATENATE($B34,\"-\",I$1),'База выдачи'!$A:$F,6,0)),VLOOKUP(CONCATENATE($B34,\"-\",I$1),База!$A:$G,6,0))","v":""},3,{"$f":"IF(ISERROR(VLOOKUP(CONCATENATE($B34,\"-\",L$1),База!$A:$G,5,0)),IF(ISERROR(VLOOKUP(CONCATENATE($B34,\"-\",L$1),'База выдачи'!$A:$F,5,0)),\"\",VLOOKUP(CONCATENATE($B34,\"-\",L$1),'База выдачи'!$A:$F,5,0)),VLOOKUP(CONCATENATE($B34,\"-\",L$1),База!$A:$G,5,0))","v":""},{"$f":"IF(ISERROR(VLOOKUP(CONCATENATE($B34,\"-\",L$1),База!$A:$G,6,0)),IF(ISERROR(VLOOKUP(CONCATENATE($B34,\"-\",L$1),'База выдачи'!$A:$F,6,0)),\"\",VLOOKUP(CONCATENATE($B34,\"-\",L$1),'База выдачи'!$A:$F,6,0)),VLOOKUP(CONCATENATE($B34,\"-\",L$1),База!$A:$G,6,0))","v":""},2,{"$f":"IF(ISERROR(VLOOKUP(CONCATENATE($B34,\"-\",O$1),База!$A:$G,5,0)),IF(ISERROR(VLOOKUP(CONCATENATE($B34,\"-\",O$1),'База выдачи'!$A:$F,5,0)),\"\",VLOOKUP(CONCATENATE($B34,\"-\",O$1),'База выдачи'!$A:$F,5,0)),VLOOKUP(CONCATENATE($B34,\"-\",O$1),База!$A:$G,5,0))","v":""},{"$f":"IF(ISERROR(VLOOKUP(CONCATENATE($B34,\"-\",O$1),База!$A:$G,6,0)),IF(ISERROR(VLOOKUP(CONCATENATE($B34,\"-\",O$1),'База выдачи'!$A:$F,6,0)),\"\",VLOOKUP(CONCATENATE($B34,\"-\",O$1),'База выдачи'!$A:$F,6,0)),VLOOKUP(CONCATENATE($B34,\"-\",O$1),База!$A:$G,6,0))","v":""},7,{"$f":"IF(ISERROR(VLOOKUP(CONCATENATE($B34,\"-\",R$1),База!$A:$G,5,0)),IF(ISERROR(VLOOKUP(CONCATENATE($B34,\"-\",R$1),'База выдачи'!$A:$F,5,0)),\"\",VLOOKUP(CONCATENATE($B34,\"-\",R$1),'База выдачи'!$A:$F,5,0)),VLOOKUP(CONCATENATE($B34,\"-\",R$1),База!$A:$G,5,0))","v":""},{"$f":"IF(ISERROR(VLOOKUP(CONCATENATE($B34,\"-\",R$1),База!$A:$G,6,0)),IF(ISERROR(VLOOKUP(CONCATENATE($B34,\"-\",R$1),'База выдачи'!$A:$F,6,0)),\"\",VLOOKUP(CONCATENATE($B34,\"-\",R$1),'База выдачи'!$A:$F,6,0)),VLOOKUP(CONCATENATE($B34,\"-\",R$1),База!$A:$G,6,0))","v":""},1,{"$f":"IF(ISERROR(VLOOKUP(CONCATENATE($B34,\"-\",U$1),База!$A:$G,5,0)),IF(ISERROR(VLOOKUP(CONCATENATE($B34,\"-\",U$1),'База выдачи'!$A:$F,5,0)),\"\",VLOOKUP(CONCATENATE($B34,\"-\",U$1),'База выдачи'!$A:$F,5,0)),VLOOKUP(CONCATENATE($B34,\"-\",U$1),База!$A:$G,5,0))","v":""},{"$f":"IF(ISERROR(VLOOKUP(CONCATENATE($B34,\"-\",U$1),База!$A:$G,6,0)),IF(ISERROR(VLOOKUP(CONCATENATE($B34,\"-\",U$1),'База выдачи'!$A:$F,6,0)),\"\",VLOOKUP(CONCATENATE($B34,\"-\",U$1),'База выдачи'!$A:$F,6,0)),VLOOKUP(CONCATENATE($B34,\"-\",U$1),База!$A:$G,6,0))","v":""},4,{"$f":"IF(ISERROR(VLOOKUP(CONCATENATE($B34,\"-\",X$1),База!$A:$G,5,0)),IF(ISERROR(VLOOKUP(CONCATENATE($B34,\"-\",X$1),'База выдачи'!$A:$F,5,0)),\"\",VLOOKUP(CONCATENATE($B34,\"-\",X$1),'База выдачи'!$A:$F,5,0)),VLOOKUP(CONCATENATE($B34,\"-\",X$1),База!$A:$G,5,0))","v":""},{"$f":"IF(ISERROR(VLOOKUP(CONCATENATE($B34,\"-\",X$1),База!$A:$G,6,0)),IF(ISERROR(VLOOKUP(CONCATENATE($B34,\"-\",X$1),'База выдачи'!$A:$F,6,0)),\"\",VLOOKUP(CONCATENATE($B34,\"-\",X$1),'База выдачи'!$A:$F,6,0)),VLOOKUP(CONCATENATE($B34,\"-\",X$1),База!$A:$G,6,0))","v":""},8,{"$f":"IF(ISERROR(VLOOKUP(CONCATENATE($B34,\"-\",AA$1),База!$A:$G,5,0)),IF(ISERROR(VLOOKUP(CONCATENATE($B34,\"-\",AA$1),'База выдачи'!$A:$F,5,0)),\"\",VLOOKUP(CONCATENATE($B34,\"-\",AA$1),'База выдачи'!$A:$F,5,0)),VLOOKUP(CONCATENATE($B34,\"-\",AA$1),База!$A:$G,5,0))","v":""},{"$f":"IF(ISERROR(VLOOKUP(CONCATENATE($B34,\"-\",AA$1),База!$A:$G,6,0)),IF(ISERROR(VLOOKUP(CONCATENATE($B34,\"-\",AA$1),'База выдачи'!$A:$F,6,0)),\"\",VLOOKUP(CONCATENATE($B34,\"-\",AA$1),'База выдачи'!$A:$F,6,0)),VLOOKUP(CONCATENATE($B34,\"-\",AA$1),База!$A:$G,6,0))","v":""},"I",{"$f":"IF(ISERROR(VLOOKUP(CONCATENATE($B34,\"-\",AD$1),База!$A:$G,5,0)),IF(ISERROR(VLOOKUP(CONCATENATE($B34,\"-\",AD$1),'База выдачи'!$A:$F,5,0)),\"\",VLOOKUP(CONCATENATE($B34,\"-\",AD$1),'База выдачи'!$A:$F,5,0)),VLOOKUP(CONCATENATE($B34,\"-\",AD$1),База!$A:$G,5,0))","v":""},{"$f":"IF(ISERROR(VLOOKUP(CONCATENATE($B34,\"-\",AD$1),База!$A:$G,6,0)),IF(ISERROR(VLOOKUP(CONCATENATE($B34,\"-\",AD$1),'База выдачи'!$A:$F,6,0)),\"\",VLOOKUP(CONCATENATE($B34,\"-\",AD$1),'База выдачи'!$A:$F,6,0)),VLOOKUP(CONCATENATE($B34,\"-\",AD$1),База!$A:$G,6,0))","v":""},"J",{"$f":"IF(ISERROR(VLOOKUP(CONCATENATE($B34,\"-\",AG$1),База!$A:$G,5,0)),IF(ISERROR(VLOOKUP(CONCATENATE($B34,\"-\",AG$1),'База выдачи'!$A:$F,5,0)),\"\",VLOOKUP(CONCATENATE($B34,\"-\",AG$1),'База выдачи'!$A:$F,5,0)),VLOOKUP(CONCATENATE($B34,\"-\",AG$1),База!$A:$G,5,0))","v":""},{"$f":"IF(ISERROR(VLOOKUP(CONCATENATE($B34,\"-\",AG$1),База!$A:$G,6,0)),IF(ISERROR(VLOOKUP(CONCATENATE($B34,\"-\",AG$1),'База выдачи'!$A:$F,6,0)),\"\",VLOOKUP(CONCATENATE($B34,\"-\",AG$1),'База выдачи'!$A:$F,6,0)),VLOOKUP(CONCATENATE($B34,\"-\",AG$1),База!$A:$G,6,0))","v":""},"K",{"$f":"IF(ISERROR(VLOOKUP(CONCATENATE($B34,\"-\",AJ$1),База!$A:$G,5,0)),IF(ISERROR(VLOOKUP(CONCATENATE($B34,\"-\",AJ$1),'База выдачи'!$A:$F,5,0)),\"\",VLOOKUP(CONCATENATE($B34,\"-\",AJ$1),'База выдачи'!$A:$F,5,0)),VLOOKUP(CONCATENATE($B34,\"-\",AJ$1),База!$A:$G,5,0))","v":""},{"$f":"IF(ISERROR(VLOOKUP(CONCATENATE($B34,\"-\",AJ$1),База!$A:$G,6,0)),IF(ISERROR(VLOOKUP(CONCATENATE($B34,\"-\",AJ$1),'База выдачи'!$A:$F,6,0)),\"\",VLOOKUP(CONCATENATE($B34,\"-\",AJ$1),'База выдачи'!$A:$F,6,0)),VLOOKUP(CONCATENATE($B34,\"-\",AJ$1),База!$A:$G,6,0))","v":""},"L",{"$f":"IF(ISERROR(VLOOKUP(CONCATENATE($B34,\"-\",AM$1),База!$A:$G,5,0)),IF(ISERROR(VLOOKUP(CONCATENATE($B34,\"-\",AM$1),'База выдачи'!$A:$F,5,0)),\"\",VLOOKUP(CONCATENATE($B34,\"-\",AM$1),'База выдачи'!$A:$F,5,0)),VLOOKUP(CONCATENATE($B34,\"-\",AM$1),База!$A:$G,5,0))","v":""},{"$f":"IF(ISERROR(VLOOKUP(CONCATENATE($B34,\"-\",AM$1),База!$A:$G,6,0)),IF(ISERROR(VLOOKUP(CONCATENATE($B34,\"-\",AM$1),'База выдачи'!$A:$F,6,0)),\"\",VLOOKUP(CONCATENATE($B34,\"-\",AM$1),'База выдачи'!$A:$F,6,0)),VLOOKUP(CONCATENATE($B34,\"-\",AM$1),База!$A:$G,6,0))","v":""},"M",{"$f":"IF(ISERROR(VLOOKUP(CONCATENATE($B34,\"-\",AP$1),База!$A:$G,5,0)),IF(ISERROR(VLOOKUP(CONCATENATE($B34,\"-\",AP$1),'База выдачи'!$A:$F,5,0)),\"\",VLOOKUP(CONCATENATE($B34,\"-\",AP$1),'База выдачи'!$A:$F,5,0)),VLOOKUP(CONCATENATE($B34,\"-\",AP$1),База!$A:$G,5,0))","v":""},{"$f":"IF(ISERROR(VLOOKUP(CONCATENATE($B34,\"-\",AP$1),База!$A:$G,6,0)),IF(ISERROR(VLOOKUP(CONCATENATE($B34,\"-\",AP$1),'База выдачи'!$A:$F,6,0)),\"\",VLOOKUP(CONCATENATE($B34,\"-\",AP$1),'База выдачи'!$A:$F,6,0)),VLOOKUP(CONCATENATE($B34,\"-\",AP$1),База!$A:$G,6,0))","v":""},"N",{"$f":"IF(ISERROR(VLOOKUP(CONCATENATE($B34,\"-\",AS$1),База!$A:$G,5,0)),IF(ISERROR(VLOOKUP(CONCATENATE($B34,\"-\",AS$1),'База выдачи'!$A:$F,5,0)),\"\",VLOOKUP(CONCATENATE($B34,\"-\",AS$1),'База выдачи'!$A:$F,5,0)),VLOOKUP(CONCATENATE($B34,\"-\",AS$1),База!$A:$G,5,0))","v":""},{"$f":"IF(ISERROR(VLOOKUP(CONCATENATE($B34,\"-\",AS$1),База!$A:$G,6,0)),IF(ISERROR(VLOOKUP(CONCATENATE($B34,\"-\",AS$1),'База выдачи'!$A:$F,6,0)),\"\",VLOOKUP(CONCATENATE($B34,\"-\",AS$1),'База выдачи'!$A:$F,6,0)),VLOOKUP(CONCATENATE($B34,\"-\",AS$1),База!$A:$G,6,0))","v":""},null,null,{"$f":"COUNTIFS(База!B:B,Статистика!B34,База!E:E,\"OK\")","v":0},{"$f":"DQ3","v":"03:03:16.770"},10997,{"$f":"COUNTIFS(База!B:B,Статистика!B34,База!E:E,\"XXXX\")","v":0},{"$f":"IF(AX34+AZ34+BA34=0,ксекундвигре-BD34,ксекундвигре*Статистика!AX34+(ксекундвигре-Статистика!AZ34)+Статистика!BA34)","v":-137},-137,32,31]
[33,{"$f":"IF(ISERROR(VLOOKUP(A35,Служебный!B:C,2,0)),\"\",A35&\"-\"&VLOOKUP(A35,Служебный!B:C,2,0))","v":""},6,{"$f":"IF(ISERROR(VLOOKUP(CONCATENATE($B35,\"-\",C$1),База!$A:$G,5,0)),IF(ISERROR(VLOOKUP(CONCATENATE($B35,\"-\",C$1),'База выдачи'!$A:$F,5,0)),\"\",VLOOKUP(CONCATENATE($B35,\"-\",C$1),'База выдачи'!$A:$F,5,0)),VLOOKUP(CONCATENATE($B35,\"-\",C$1),База!$A:$G,5,0))","v":""},{"$f":"IF(ISERROR(VLOOKUP(CONCATENATE($B35,\"-\",C$1),База!$A:$G,6,0)),IF(ISERROR(VLOOKUP(CONCATENATE($B35,\"-\",C$1),'База выдачи'!$A:$F,6,0)),\"\",VLOOKUP(CONCATENATE($B35,\"-\",C$1),'База выдачи'!$A:$F,6,0)),VLOOKUP(CONCATENATE($B35,\"-\",C$1),База!$A:$G,6,0))","v":""},8,{"$f":"IF(ISERROR(VLOOKUP(CONCATENATE($B35,\"-\",F$1),База!$A:$G,5,0)),IF(ISERROR(VLOOKUP(CONCATENATE($B35,\"-\",F$1),'База выдачи'!$A:$F,5,0)),\"\",VLOOKUP(CONCATENATE($B35,\"-\",F$1),'База выдачи'!$A:$F,5,0)),VLOOKUP(CONCATENATE($B35,\"-\",F$1),База!$A:$G,5,0))","v":""},{"$f":"IF(ISERROR(VLOOKUP(CONCATENATE($B35,\"-\",F$1),База!$A:$G,6,0)),IF(ISERROR(VLOOKUP(CONCATENATE($B35,\"-\",F$1),'База выдачи'!$A:$F,6,0)),\"\",VLOOKUP(CONCATENATE($B35,\"-\",F$1),'База выдачи'!$A:$F,6,0)),VLOOKUP(CONCATENATE($B35,\"-\",F$1),База!$A:$G,6,0))","v":""},2,{"$f":"IF(ISERROR(VLOOKUP(CONCATENATE($B35,\"-\",I$1),База!$A:$G,5,0)),IF(ISERROR(VLOOKUP(CONCATENATE($B35,\"-\",I$1),'База выдачи'!$A:$F,5,0)),\"\",VLOOKUP(CONCATENATE($B35,\"-\",I$1),'База выдачи'!$A:$F,5,0)),VLOOKUP(CONCATENATE($B35,\"-\",I$1),База!$A:$G,5,0))","v":""},{"$f":"IF(ISERROR(VLOOKUP(CONCATENATE($B35,\"-\",I$1),База!$A:$G,6,0)),IF(ISERROR(VLOOKUP(CONCATENATE($B35,\"-\",I$1),'База выдачи'!$A:$F,6,0)),\"\",VLOOKUP(CONCATENATE($B35,\"-\",I$1),'База выдачи'!$A:$F,6,0)),VLOOKUP(CONCATENATE($B35,\"-\",I$1),База!$A:$G,6,0))","v":""},7,{"$f":"IF(ISERROR(VLOOKUP(CONCATENATE($B35,\"-\",L$1),База!$A:$G,5,0)),IF(ISERROR(VLOOKUP(CONCATENATE($B35,\"-\",L$1),'База выдачи'!$A:$F,5,0)),\"\",VLOOKUP(CONCATENATE($B35,\"-\",L$1),'База выдачи'!$A:$F,5,0)),VLOOKUP(CONCATENATE($B35,\"-\",L$1),База!$A:$G,5,0))","v":""},{"$f":"IF(ISERROR(VLOOKUP(CONCATENATE($B35,\"-\",L$1),База!$A:$G,6,0)),IF(ISERROR(VLOOKUP(CONCATENATE($B35,\"-\",L$1),'База выдачи'!$A:$F,6,0)),\"\",VLOOKUP(CONCATENATE($B35,\"-\",L$1),'База выдачи'!$A:$F,6,0)),VLOOKUP(CONCATENATE($B35,\"-\",L$1),База!$A:$G,6,0))","v":""},3,{"$f":"IF(ISERROR(VLOOKUP(CONCATENATE($B35,\"-\",O$1),База!$A:$G,5,0)),IF(ISERROR(VLOOKUP(CONCATENATE($B35,\"-\",O$1),'База выдачи'!$A:$F,5,0)),\"\",VLOOKUP(CONCATENATE($B35,\"-\",O$1),'База выдачи'!$A:$F,5,0)),VLOOKUP(CONCATENATE($B35,\"-\",O$1),База!$A:$G,5,0))","v":""},{"$f":"IF(ISERROR(VLOOKUP(CONCATENATE($B35,\"-\",O$1),База!$A:$G,6,0)),IF(ISERROR(VLOOKUP(CONCATENATE($B35,\"-\",O$1),'База выдачи'!$A:$F,6,0)),\"\",VLOOKUP(CONCATENATE($B35,\"-\",O$1),'База выдачи'!$A:$F,6,0)),VLOOKUP(CONCATENATE($B35,\"-\",O$1),База!$A:$G,6,0))","v":""},5,{"$f":"IF(ISERROR(VLOOKUP(CONCATENATE($B35,\"-\",R$1),База!$A:$G,5,0)),IF(ISERROR(VLOOKUP(CONCATENATE($B35,\"-\",R$1),'База выдачи'!$A:$F,5,0)),\"\",VLOOKUP(CONCATENATE($B35,\"-\",R$1),'База выдачи'!$A:$F,5,0)),VLOOKUP(CONCATENATE($B35,\"-\",R$1),База!$A:$G,5,0))","v":""},{"$f":"IF(ISERROR(VLOOKUP(CONCATENATE($B35,\"-\",R$1),База!$A:$G,6,0)),IF(ISERROR(VLOOKUP(CONCATENATE($B35,\"-\",R$1),'База выдачи'!$A:$F,6,0)),\"\",VLOOKUP(CONCATENATE($B35,\"-\",R$1),'База выдачи'!$A:$F,6,0)),VLOOKUP(CONCATENATE($B35,\"-\",R$1),База!$A:$G,6,0))","v":""},9,{"$f":"IF(ISERROR(VLOOKUP(CONCATENATE($B35,\"-\",U$1),База!$A:$G,5,0)),IF(ISERROR(VLOOKUP(CONCATENATE($B35,\"-\",U$1),'База выдачи'!$A:$F,5,0)),\"\",VLOOKUP(CONCATENATE($B35,\"-\",U$1),'База выдачи'!$A:$F,5,0)),VLOOKUP(CONCATENATE($B35,\"-\",U$1),База!$A:$G,5,0))","v":""},{"$f":"IF(ISERROR(VLOOKUP(CONCATENATE($B35,\"-\",U$1),База!$A:$G,6,0)),IF(ISERROR(VLOOKUP(CONCATENATE($B35,\"-\",U$1),'База выдачи'!$A:$F,6,0)),\"\",VLOOKUP(CONCATENATE($B35,\"-\",U$1),'База выдачи'!$A:$F,6,0)),VLOOKUP(CONCATENATE($B35,\"-\",U$1),База!$A:$G,6,0))","v":""},1,{"$f":"IF(ISERROR(VLOOKUP(CONCATENATE($B35,\"-\",X$1),База!$A:$G,5,0)),IF(ISERROR(VLOOKUP(CONCATENATE($B35,\"-\",X$1),'База выдачи'!$A:$F,5,0)),\"\",VLOOKUP(CONCATENATE($B35,\"-\",X$1),'База выдачи'!$A:$F,5,0)),VLOOKUP(CONCATENATE($B35,\"-\",X$1),База!$A:$G,5,0))","v":""},{"$f":"IF(ISERROR(VLOOKUP(CONCATENATE($B35,\"-\",X$1),База!$A:$G,6,0)),IF(ISERROR(VLOOKUP(CONCATENATE($B35,\"-\",X$1),'База выдачи'!$A:$F,6,0)),\"\",VLOOKUP(CONCATENATE($B35,\"-\",X$1),'База выдачи'!$A:$F,6,0)),VLOOKUP(CONCATENATE($B35,\"-\",X$1),База!$A:$G,6,0))","v":""},4,{"$f":"IF(ISERROR(VLOOKUP(CONCATENATE($B35,\"-\",AA$1),База!$A:$G,5,0)),IF(ISERROR(VLOOKUP(CONCATENATE($B35,\"-\",AA$1),'База выдачи'!$A:$F,5,0)),\"\",VLOOKUP(CONCATENATE($B35,\"-\",AA$1),'База выдачи'!$A:$F,5,0)),VLOOKUP(CONCATENATE($B35,\"-\",AA$1),База!$A:$G,5,0))","v":""},{"$f":"IF(ISERROR(VLOOKUP(CONCATENATE($B35,\"-\",AA$1),База!$A:$G,6,0)),IF(ISERROR(VLOOKUP(CONCATENATE($B35,\"-\",AA$1),'База выдачи'!$A:$F,6,0)),\"\",VLOOKUP(CONCATENATE($B35,\"-\",AA$1),'База выдачи'!$A:$F,6,0)),VLOOKUP(CONCATENATE($B35,\"-\",AA$1),База!$A:$G,6,0))","v":""},"H",{"$f":"IF(ISERROR(VLOOKUP(CONCATENATE($B35,\"-\",AD$1),База!$A:$G,5,0)),IF(ISERROR(VLOOKUP(CONCATENATE($B35,\"-\",AD$1),'База выдачи'!$A:$F,5,0)),\"\",VLOOKUP(CONCATENATE($B35,\"-\",AD$1),'База выдачи'!$A:$F,5,0)),VLOOKUP(CONCATENATE($B35,\"-\",AD$1),База!$A:$G,5,0))","v":""},{"$f":"IF(ISERROR(VLOOKUP(CONCATENATE($B35,\"-\",AD$1),База!$A:$G,6,0)),IF(ISERROR(VLOOKUP(CONCATENATE($B35,\"-\",AD$1),'База выдачи'!$A:$F,6,0)),\"\",VLOOKUP(CONCATENATE($B35,\"-\",AD$1),'База выдачи'!$A:$F,6,0)),VLOOKUP(CONCATENATE($B35,\"-\",AD$1),База!$A:$G,6,0))","v":""},"I",{"$f":"IF(ISERROR(VLOOKUP(CONCATENATE($B35,\"-\",AG$1),База!$A:$G,5,0)),IF(ISERROR(VLOOKUP(CONCATENATE($B35,\"-\",AG$1),'База выдачи'!$A:$F,5,0)),\"\",VLOOKUP(CONCATENATE($B35,\"-\",AG$1),'База выдачи'!$A:$F,5,0)),VLOOKUP(CONCATENATE($B35,\"-\",AG$1),База!$A:$G,5,0))","v":""},{"$f":"IF(ISERROR(VLOOKUP(CONCATENATE($B35,\"-\",AG$1),База!$A:$G,6,0)),IF(ISERROR(VLOOKUP(CONCATENATE($B35,\"-\",AG$1),'База выдачи'!$A:$F,6,0)),\"\",VLOOKUP(CONCATENATE($B35,\"-\",AG$1),'База выдачи'!$A:$F,6,0)),VLOOKUP(CONCATENATE($B35,\"-\",AG$1),База!$A:$G,6,0))","v":""},"J",{"$f":"IF(ISERROR(VLOOKUP(CONCATENATE($B35,\"-\",AJ$1),База!$A:$G,5,0)),IF(ISERROR(VLOOKUP(CONCATENATE($B35,\"-\",AJ$1),'База выдачи'!$A:$F,5,0)),\"\",VLOOKUP(CONCATENATE($B35,\"-\",AJ$1),'База выдачи'!$A:$F,5,0)),VLOOKUP(CONCATENATE($B35,\"-\",AJ$1),База!$A:$G,5,0))","v":""},{"$f":"IF(ISERROR(VLOOKUP(CONCATENATE($B35,\"-\",AJ$1),База!$A:$G,6,0)),IF(ISERROR(VLOOKUP(CONCATENATE($B35,\"-\",AJ$1),'База выдачи'!$A:$F,6,0)),\"\",VLOOKUP(CONCATENATE($B35,\"-\",AJ$1),'База выдачи'!$A:$F,6,0)),VLOOKUP(CONCATENATE($B35,\"-\",AJ$1),База!$A:$G,6,0))","v":""},"K",{"$f":"IF(ISERROR(VLOOKUP(CONCATENATE($B35,\"-\",AM$1),База!$A:$G,5,0)),IF(ISERROR(VLOOKUP(CONCATENATE($B35,\"-\",AM$1),'База выдачи'!$A:$F,5,0)),\"\",VLOOKUP(CONCATENATE($B35,\"-\",AM$1),'База выдачи'!$A:$F,5,0)),VLOOKUP(CONCATENATE($B35,\"-\",AM$1),База!$A:$G,5,0))","v":""},{"$f":"IF(ISERROR(VLOOKUP(CONCATENATE($B35,\"-\",AM$1),База!$A:$G,6,0)),IF(ISERROR(VLOOKUP(CONCATENATE($B35,\"-\",AM$1),'База выдачи'!$A:$F,6,0)),\"\",VLOOKUP(CONCATENATE($B35,\"-\",AM$1),'База выдачи'!$A:$F,6,0)),VLOOKUP(CONCATENATE($B35,\"-\",AM$1),База!$A:$G,6,0))","v":""},"L",{"$f":"IF(ISERROR(VLOOKUP(CONCATENATE($B35,\"-\",AP$1),База!$A:$G,5,0)),IF(ISERROR(VLOOKUP(CONCATENATE($B35,\"-\",AP$1),'База выдачи'!$A:$F,5,0)),\"\",VLOOKUP(CONCATENATE($B35,\"-\",AP$1),'База выдачи'!$A:$F,5,0)),VLOOKUP(CONCATENATE($B35,\"-\",AP$1),База!$A:$G,5,0))","v":""},{"$f":"IF(ISERROR(VLOOKUP(CONCATENATE($B35,\"-\",AP$1),База!$A:$G,6,0)),IF(ISERROR(VLOOKUP(CONCATENATE($B35,\"-\",AP$1),'База выдачи'!$A:$F,6,0)),\"\",VLOOKUP(CONCATENATE($B35,\"-\",AP$1),'База выдачи'!$A:$F,6,0)),VLOOKUP(CONCATENATE($B35,\"-\",AP$1),База!$A:$G,6,0))","v":""},"M",{"$f":"IF(ISERROR(VLOOKUP(CONCATENATE($B35,\"-\",AS$1),База!$A:$G,5,0)),IF(ISERROR(VLOOKUP(CONCATENATE($B35,\"-\",AS$1),'База выдачи'!$A:$F,5,0)),\"\",VLOOKUP(CONCATENATE($B35,\"-\",AS$1),'База выдачи'!$A:$F,5,0)),VLOOKUP(CONCATENATE($B35,\"-\",AS$1),База!$A:$G,5,0))","v":""},{"$f":"IF(ISERROR(VLOOKUP(CONCATENATE($B35,\"-\",AS$1),База!$A:$G,6,0)),IF(ISERROR(VLOOKUP(CONCATENATE($B35,\"-\",AS$1),'База выдачи'!$A:$F,6,0)),\"\",VLOOKUP(CONCATENATE($B35,\"-\",AS$1),'База выдачи'!$A:$F,6,0)),VLOOKUP(CONCATENATE($B35,\"-\",AS$1),База!$A:$G,6,0))","v":""},null,null,{"$f":"COUNTIFS(База!B:B,Статистика!B35,База!E:E,\"OK\")","v":0},{"$f":"DS3","v":"03:03:16.770"},10997,{"$f":"COUNTIFS(База!B:B,Статистика!B35,База!E:E,\"XXXX\")","v":0},{"$f":"IF(AX35+AZ35+BA35=0,ксекундвигре-BD35,ксекундвигре*Статистика!AX35+(ксекундвигре-Статистика!AZ35)+Статистика!BA35)","v":-137},-137,33,31]
[34,{"$f":"IF(ISERROR(VLOOKUP(A36,Служебный!B:C,2,0)),\"\",A36&\"-\"&VLOOKUP(A36,Служебный!B:C,2,0))","v":""},7,{"$f":"IF(ISERROR(VLOOKUP(CONCATENATE($B36,\"-\",C$1),База!$A:$G,5,0)),IF(ISERROR(VLOOKUP(CONCATENATE($B36,\"-\",C$1),'База выдачи'!$A:$F,5,0)),\"\",VLOOKUP(CONCATENATE($B36,\"-\",C$1),'База выдачи'!$A:$F,5,0)),VLOOKUP(CONCATENATE($B36,\"-\",C$1),База!$A:$G,5,0))","v":""},{"$f":"IF(ISERROR(VLOOKUP(CONCATENATE($B36,\"-\",C$1),База!$A:$G,6,0)),IF(ISERROR(VLOOKUP(CONCATENATE($B36,\"-\",C$1),'База выдачи'!$A:$F,6,0)),\"\",VLOOKUP(CONCATENATE($B36,\"-\",C$1),'База выдачи'!$A:$F,6,0)),VLOOKUP(CONCATENATE($B36,\"-\",C$1),База!$A:$G,6,0))","v":""},9,{"$f":"IF(ISERROR(VLOOKUP(CONCATENATE($B36,\"-\",F$1),База!$A:$G,5,0)),IF(ISERROR(VLOOKUP(CONCATENATE($B36,\"-\",F$1),'База выдачи'!$A:$F,5,0)),\"\",VLOOKUP(CONCATENATE($B36,\"-\",F$1),'База выдачи'!$A:$F,5,0)),VLOOKUP(CONCATENATE($B36,\"-\",F$1),База!$A:$G,5,0))","v":""},{"$f":"IF(ISERROR(VLOOKUP(CONCATENATE($B36,\"-\",F$1),База!$A:$G,6,0)),IF(ISERROR(VLOOKUP(CONCATENATE($B36,\"-\",F$1),'База выдачи'!$A:$F,6,0)),\"\",VLOOKUP(CONCATENATE($B36,\"-\",F$1),'База выдачи'!$A:$F,6,0)),VLOOKUP(CONCATENATE($B36,\"-\",F$1),База!$A:$G,6,0))","v":""},8,{"$f":"IF(ISERROR(VLOOKUP(CONCATENATE($B36,\"-\",I$1),База!$A:$G,5,0)),IF(ISERROR(VLOOKUP(CONCATENATE($B36,\"-\",I$1),'База выдачи'!$A:$F,5,0)),\"\",VLOOKUP(CONCATENATE($B36,\"-\",I$1),'База выдачи'!$A:$F,5,0)),VLOOKUP(CONCATENATE($B36,\"-\",I$1),База!$A:$G,5,0))","v":""},{"$f":"IF(ISERROR(VLOOKUP(CONCATENATE($B36,\"-\",I$1),База!$A:$G,6,0)),IF(ISERROR(VLOOKUP(CONCATENATE($B36,\"-\",I$1),'База выдачи'!$A:$F,6,0)),\"\",VLOOKUP(CONCATENATE($B36,\"-\",I$1),'База выдачи'!$A:$F,6,0)),VLOOKUP(CONCATENATE($B36,\"-\",I$1),База!$A:$G,6,0))","v":""},1,{"$f":"IF(ISERROR(VLOOKUP(CONCATENATE($B36,\"-\",L$1),База!$A:$G,5,0)),IF(ISERROR(VLOOKUP(CONCATENATE($B36,\"-\",L$1),'База выдачи'!$A:$F,5,0)),\"\",VLOOKUP(CONCATENATE($B36,\"-\",L$1),'База выдачи'!$A:$F,5,0)),VLOOKUP(CONCATENATE($B36,\"-\",L$1),База!$A:$G,5,0))","v":""},{"$f":"IF(ISERROR(VLOOKUP(CONCATENATE($B36,\"-\",L$1),База!$A:$G,6,0)),IF(ISERROR(VLOOKUP(CONCATENATE($B36,\"-\",L$1),'База выдачи'!$A:$F,6,0)),\"\",VLOOKUP(CONCATENATE($B36,\"-\",L$1),'База выдачи'!$A:$F,6,0)),VLOOKUP(CONCATENATE($B36,\"-\",L$1),База!$A:$G,6,0))","v":""},6,{"$f":"IF(ISERROR(VLOOKUP(CONCATENATE($B36,\"-\",O$1),База!$A:$G,5,0)),IF(ISERROR(VLOOKUP(CONCATENATE($B36,\"-\",O$1),'База выдачи'!$A:$F,5,0)),\"\",VLOOKUP(CONCATENATE($B36,\"-\",O$1),'База выдачи'!$A:$F,5,0)),VLOOKUP(CONCATENATE($B36,\"-\",O$1),База!$A:$G,5,0))","v":""},{"$f":"IF(ISERROR(VLOOKUP(CONCATENATE($B36,\"-\",O$1),База!$A:$G,6,0)),IF(ISERROR(VLOOKUP(CONCATENATE($B36,\"-\",O$1),'База выдачи'!$A:$F,6,0)),\"\",VLOOKUP(CONCATENATE($B36,\"-\",O$1),'База выдачи'!$A:$F,6,0)),VLOOKUP(CONCATENATE($B36,\"-\",O$1),База!$A:$G,6,0))","v":""},4,{"$f":"IF(ISERROR(VLOOKUP(CONCATENATE($B36,\"-\",R$1),База!$A:$G,5,0)),IF(ISERROR(VLOOKUP(CONCATENATE($B36,\"-\",R$1),'База выдачи'!$A:$F,5,0)),\"\",VLOOKUP(CONCATENATE($B36,\"-\",R$1),'База выдачи'!$A:$F,5,0)),VLOOKUP(CONCATENATE($B36,\"-\",R$1),База!$A:$G,5,0))","v":""},{"$f":"IF(ISERROR(VLOOKUP(CONCATENATE($B36,\"-\",R$1),База!$A:$G,6,0)),IF(ISERROR(VLOOKUP(CONCATENATE($B36,\"-\",R$1),'База выдачи'!$A:$F,6,0)),\"\",VLOOKUP(CONCATENATE($B36,\"-\",R$1),'База выдачи'!$A:$F,6,0)),VLOOKUP(CONCATENATE($B36,\"-\",R$1),База!$A:$G,6,0))","v":""},5,{"$f":"IF(ISERROR(VLOOKUP(CONCATENATE($B36,\"-\",U$1),База!$A:$G,5,0)),IF(ISERROR(VLOOKUP(CONCATENATE($B36,\"-\",U$1),'База выдачи'!$A:$F,5,0)),\"\",VLOOKUP(CONCATENATE($B36,\"-\",U$1),'База выдачи'!$A:$F,5,0)),VLOOKUP(CONCATENATE($B36,\"-\",U$1),База!$A:$G,5,0))","v":""},{"$f":"IF(ISERROR(VLOOKUP(CONCATENATE($B36,\"-\",U$1),База!$A:$G,6,0)),IF(ISERROR(VLOOKUP(CONCATENATE($B36,\"-\",U$1),'База выдачи'!$A:$F,6,0)),\"\",VLOOKUP(CONCATENATE($B36,\"-\",U$1),'База выдачи'!$A:$F,6,0)),VLOOKUP(CONCATENATE($B36,\"-\",U$1),База!$A:$G,6,0))","v":""},3,{"$f":"IF(ISERROR(VLOOKUP(CONCATENATE($B36,\"-\",X$1),База!$A:$G,5,0)),IF(ISERROR(VLOOKUP(CONCATENATE($B36,\"-\",X$1),'База выдачи'!$A:$F,5,0)),\"\",VLOOKUP(CONCATENATE($B36,\"-\",X$1),'База выдачи'!$A:$F,5,0)),VLOOKUP(CONCATENATE($B36,\"-\",X$1),База!$A:$G,5,0))","v":""},{"$f":"IF(ISERROR(VLOOKUP(CONCATENATE($B36,\"-\",X$1),База!$A:$G,6,0)),IF(ISERROR(VLOOKUP(CONCATENATE($B36,\"-\",X$1),'База выдачи'!$A:$F,6,0)),\"\",VLOOKUP(CONCATENATE($B36,\"-\",X$1),'База выдачи'!$A:$F,6,0)),VLOOKUP(CONCATENATE($B36,\"-\",X$1),База!$A:$G,6,0))","v":""},2,{"$f":"IF(ISERROR(VLOOKUP(CONCATENATE($B36,\"-\",AA$1),База!$A:$G,5,0)),IF(ISERROR(VLOOKUP(CONCATENATE($B36,\"-\",AA$1),'База выдачи'!$A:$F,5,0)),\"\",VLOOKUP(CONCATENATE($B36,\"-\",AA$1),'База выдачи'!$A:$F,5,0)),VLOOKUP(CONCATENATE($B36,\"-\",AA$1),База!$A:$G,5,0))","v":""},{"$f":"IF(ISERROR(VLOOKUP(CONCATENATE($B36,\"-\",AA$1),База!$A:$G,6,0)),IF(ISERROR(VLOOKUP(CONCATENATE($B36,\"-\",AA$1),'База выдачи'!$A:$F,6,0)),\"\",VLOOKUP(CONCATENATE($B36,\"-\",AA$1),'База выдачи'!$A:$F,6,0)),VLOOKUP(CONCATENATE($B36,\"-\",AA$1),База!$A:$G,6,0))","v":""},"G",{"$f":"IF(ISERROR(VLOOKUP(CONCATENATE($B36,\"-\",AD$1),База!$A:$G,5,0)),IF(ISERROR(VLOOKUP(CONCATENATE($B36,\"-\",AD$1),'База выдачи'!$A:$F,5,0)),\"\",VLOOKUP(CONCATENATE($B36,\"-\",AD$1),'База выдачи'!$A:$F,5,0)),VLOOKUP(CONCATENATE($B36,\"-\",AD$1),База!$A:$G,5,0))","v":""},{"$f":"IF(ISERROR(VLOOKUP(CONCATENATE($B36,\"-\",AD$1),База!$A:$G,6,0)),IF(ISERROR(VLOOKUP(CONCATENATE($B36,\"-\",AD$1),'База выдачи'!$A:$F,6,0)),\"\",VLOOKUP(CONCATENATE($B36,\"-\",AD$1),'База выдачи'!$A:$F,6,0)),VLOOKUP(CONCATENATE($B36,\"-\",AD$1),База!$A:$G,6,0))","v":""},"H",{"$f":"IF(ISERROR(VLOOKUP(CONCATENATE($B36,\"-\",AG$1),База!$A:$G,5,0)),IF(ISERROR(VLOOKUP(CONCATENATE($B36,\"-\",AG$1),'База выдачи'!$A:$F,5,0)),\"\",VLOOKUP(CONCATENATE($B36,\"-\",AG$1),'База выдачи'!$A:$F,5,0)),VLOOKUP(CONCATENATE($B36,\"-\",AG$1),База!$A:$G,5,0))","v":""},{"$f":"IF(ISERROR(VLOOKUP(CONCATENATE($B36,\"-\",AG$1),База!$A:$G,6,0)),IF(ISERROR(VLOOKUP(CONCATENATE($B36,\"-\",AG$1),'База выдачи'!$A:$F,6,0)),\"\",VLOOKUP(CONCATENATE($B36,\"-\",AG$1),'База выдачи'!$A:$F,6,0)),VLOOKUP(CONCATENATE($B36,\"-\",AG$1),База!$A:$G,6,0))","v":""},"I",{"$f":"IF(ISERROR(VLOOKUP(CONCATENATE($B36,\"-\",AJ$1),База!$A:$G,5,0)),IF(ISERROR(VLOOKUP(CONCATENATE($B36,\"-\",AJ$1),'База выдачи'!$A:$F,5,0)),\"\",VLOOKUP(CONCATENATE($B36,\"-\",AJ$1),'База выдачи'!$A:$F,5,0)),VLOOKUP(CONCATENATE($B36,\"-\",AJ$1),База!$A:$G,5,0))","v":""},{"$f":"IF(ISERROR(VLOOKUP(CONCATENATE($B36,\"-\",AJ$1),База!$A:$G,6,0)),IF(ISERROR(VLOOKUP(CONCATENATE($B36,\"-\",AJ$1),'База выдачи'!$A:$F,6,0)),\"\",VLOOKUP(CONCATENATE($B36,\"-\",AJ$1),'База выдачи'!$A:$F,6,0)),VLOOKUP(CONCATENATE($B36,\"-\",AJ$1),База!$A:$G,6,0))","v":""},"J",{"$f":"IF(ISERROR(VLOOKUP(CONCATENATE($B36,\"-\",AM$1),База!$A:$G,5,0)),IF(ISERROR(VLOOKUP(CONCATENATE($B36,\"-\",AM$1),'База выдачи'!$A:$F,5,0)),\"\",VLOOKUP(CONCATENATE($B36,\"-\",AM$1),'База выдачи'!$A:$F,5,0)),VLOOKUP(CONCATENATE($B36,\"-\",AM$1),База!$A:$G,5,0))","v":""},{"$f":"IF(ISERROR(VLOOKUP(CONCATENATE($B36,\"-\",AM$1),База!$A:$G,6,0)),IF(ISERROR(VLOOKUP(CONCATENATE($B36,\"-\",AM$1),'База выдачи'!$A:$F,6,0)),\"\",VLOOKUP(CONCATENATE($B36,\"-\",AM$1),'База выдачи'!$A:$F,6,0)),VLOOKUP(CONCATENATE($B36,\"-\",AM$1),База!$A:$G,6,0))","v":""},"K",{"$f":"IF(ISERROR(VLOOKUP(CONCATENATE($B36,\"-\",AP$1),База!$A:$G,5,0)),IF(ISERROR(VLOOKUP(CONCATENATE($B36,\"-\",AP$1),'База выдачи'!$A:$F,5,0)),\"\",VLOOKUP(CONCATENATE($B36,\"-\",AP$1),'База выдачи'!$A:$F,5,0)),VLOOKUP(CONCATENATE($B36,\"-\",AP$1),База!$A:$G,5,0))","v":""},{"$f":"IF(ISERROR(VLOOKUP(CONCATENATE($B36,\"-\",AP$1),База!$A:$G,6,0)),IF(ISERROR(VLOOKUP(CONCATENATE($B36,\"-\",AP$1),'База выдачи'!$A:$F,6,0)),\"\",VLOOKUP(CONCATENATE($B36,\"-\",AP$1),'База выдачи'!$A:$F,6,0)),VLOOKUP(CONCATENATE($B36,\"-\",AP$1),База!$A:$G,6,0))","v":""},"L",{"$f":"IF(ISERROR(VLOOKUP(CONCATENATE($B36,\"-\",AS$1),База!$A:$G,5,0)),IF(ISERROR(VLOOKUP(CONCATENATE($B36,\"-\",AS$1),'База выдачи'!$A:$F,5,0)),\"\",VLOOKUP(CONCATENATE($B36,\"-\",AS$1),'База выдачи'!$A:$F,5,0)),VLOOKUP(CONCATENATE($B36,\"-\",AS$1),База!$A:$G,5,0))","v":""},{"$f":"IF(ISERROR(VLOOKUP(CONCATENATE($B36,\"-\",AS$1),База!$A:$G,6,0)),IF(ISERROR(VLOOKUP(CONCATENATE($B36,\"-\",AS$1),'База выдачи'!$A:$F,6,0)),\"\",VLOOKUP(CONCATENATE($B36,\"-\",AS$1),'База выдачи'!$A:$F,6,0)),VLOOKUP(CONCATENATE($B36,\"-\",AS$1),База!$A:$G,6,0))","v":""},null,null,{"$f":"COUNTIFS(База!B:B,Статистика!B36,База!E:E,\"OK\")","v":0},{"$f":"DU3","v":"03:03:16.770"},10997,{"$f":"COUNTIFS(База!B:B,Статистика!B36,База!E:E,\"XXXX\")","v":0},{"$f":"IF(AX36+AZ36+BA36=0,ксекундвигре-BD36,ксекундвигре*Статистика!AX36+(ксекундвигре-Статистика!AZ36)+Статистика!BA36)","v":-137},-137,34,31]
[35,{"$f":"IF(ISERROR(VLOOKUP(A37,Служебный!B:C,2,0)),\"\",A37&\"-\"&VLOOKUP(A37,Служебный!B:C,2,0))","v":""},8,{"$f":"IF(ISERROR(VLOOKUP(CONCATENATE($B37,\"-\",C$1),База!$A:$G,5,0)),IF(ISERROR(VLOOKUP(CONCATENATE($B37,\"-\",C$1),'База выдачи'!$A:$F,5,0)),\"\",VLOOKUP(CONCATENATE($B37,\"-\",C$1),'База выдачи'!$A:$F,5,0)),VLOOKUP(CONCATENATE($B37,\"-\",C$1),База!$A:$G,5,0))","v":""},{"$f":"IF(ISERROR(VLOOKUP(CONCATENATE($B37,\"-\",C$1),База!$A:$G,6,0)),IF(ISERROR(VLOOKUP(CONCATENATE($B37,\"-\",C$1),'База выдачи'!$A:$F,6,0)),\"\",VLOOKUP(CONCATENATE($B37,\"-\",C$1),'База выдачи'!$A:$F,6,0)),VLOOKUP(CONCATENATE($B37,\"-\",C$1),База!$A:$G,6,0))","v":""},1,{"$f":"IF(ISERROR(VLOOKUP(CONCATENATE($B37,\"-\",F$1),База!$A:$G,5,0)),IF(ISERROR(VLOOKUP(CONCATENATE($B37,\"-\",F$1),'База выдачи'!$A:$F,5,0)),\"\",VLOOKUP(CONCATENATE($B37,\"-\",F$1),'База выдачи'!$A:$F,5,0)),VLOOKUP(CONCATENATE($B37,\"-\",F$1),База!$A:$G,5,0))","v":""},{"$f":"IF(ISERROR(VLOOKUP(CONCATENATE($B37,\"-\",F$1),База!$A:$G,6,0)),IF(ISERROR(VLOOKUP(CONCATENATE($B37,\"-\",F$1),'База выдачи'!$A:$F,6,0)),\"\",VLOOKUP(CONCATENATE($B37,\"-\",F$1),'База выдачи'!$A:$F,6,0)),VLOOKUP(CONCATENATE($B37,\"-\",F$1),База!$A:$G,6,0))","v":""},4,{"$f":"IF(ISERROR(VLOOKUP(CONCATENATE($B37,\"-\",I$1),База!$A:$G,5,0)),IF(ISERROR(VLOOKUP(CONCATENATE($B37,\"-\",I$1),'База выдачи'!$A:$F,5,0)),\"\",VLOOKUP(CONCATENATE($B37,\"-\",I$1),'База выдачи'!$A:$F,5,0)),VLOOKUP(CONCATENATE($B37,\"-\",I$1),База!$A:$G,5,0))","v":""},{"$f":"IF(ISERROR(VLOOKUP(CONCATENATE($B37,\"-\",I$1),База!$A:$G,6,0)),IF(ISERROR(VLOOKUP(CONCATENATE($B37,\"-\",I$1),'База выдачи'!$A:$F,6,0)),\"\",VLOOKUP(CONCATENATE($B37,\"-\",I$1),'База выдачи'!$A:$F,6,0)),VLOOKUP(CONCATENATE($B37,\"-\",I$1),База!$A:$G,6,0))","v":""},6,{"$f":"IF(ISERROR(VLOOKUP(CONCATENATE($B37,\"-\",L$1),База!$A:$G,5,0)),IF(ISERROR(VLOOKUP(CONCATENATE($B37,\"-\",L$1),'База выдачи'!$A:$F,5,0)),\"\",VLOOKUP(CONCATENATE($B37,\"-\",L$1),'База выдачи'!$A:$F,5,0)),VLOOKUP(CONCATENATE($B37,\"-\",L$1),База!$A:$G,5,0))","v":""},{"$f":"IF(ISERROR(VLOOKUP(CONCATENATE($B37,\"-\",L$1),База!$A:$G,6,0)),IF(ISERROR(VLOOKUP(CONCATENATE($B37,\"-\",L$1),'База выдачи'!$A:$F,6,0)),\"\",VLOOKUP(CONCATENATE($B37,\"-\",L$1),'База выдачи'!$A:$F,6,0)),VLOOKUP(CONCATENATE($B37,\"-\",L$1),База!$A:$G,6,0))","v":""},7,{"$f":"IF(ISERROR(VLOOKUP(CONCATENATE($B37,\"-\",O$1),База!$A:$G,5,0)),IF(ISERROR(VLOOKUP(CONCATENATE($B37,\"-\",O$1),'База выдачи'!$A:$F,5,0)),\"\",VLOOKUP(CONCATENATE($B37,\"-\",O$1),'База выдачи'!$A:$F,5,0)),VLOOKUP(CONCATENATE($B37,\"-\",O$1),База!$A:$G,5,0))","v":""},{"$f":"IF(ISERROR(VLOOKUP(CONCATENATE($B37,\"-\",O$1),База!$A:$G,6,0)),IF(ISERROR(VLOOKUP(CONCATENATE($B37,\"-\",O$1),'База выдачи'!$A:$F,6,0)),\"\",VLOOKUP(CONCATENATE($B37,\"-\",O$1),'База выдачи'!$A:$F,6,0)),VLOOKUP(CONCATENATE($B37,\"-\",O$1),База!$A:$G,6,0))","v":""},3,{"$f":"IF(ISERROR(VLOOKUP(CONCATENATE($B37,\"-\",R$1),База!$A:$G,5,0)),IF(ISERROR(VLOOKUP(CONCATENATE($B37,\"-\",R$1),'База выдачи'!$A:$F,5,0)),\"\",VLOOKUP(CONCATENATE($B37,\"-\",R$1),'База выдачи'!$A:$F,5,0)),VLOOKUP(CONCATENATE($B37,\"-\",R$1),База!$A:$G,5,0))","v":""},{"$f":"IF(ISERROR(VLOOKUP(CONCATENATE($B37,\"-\",R$1),База!$A:$G,6,0)),IF(ISERROR(VLOOKUP(CONCATENATE($B37,\"-\",R$1),'База выдачи'!$A:$F,6,0)),\"\",VLOOKUP(CONCATENATE($B37,\"-\",R$1),'База выдачи'!$A:$F,6,0)),VLOOKUP(CONCATENATE($B37,\"-\",R$1),База!$A:$G,6,0))","v":""},2,{"$f":"IF(ISERROR(VLOOKUP(CONCATENATE($B37,\"-\",U$1),База!$A:$G,5,0)),IF(ISERROR(VLOOKUP(CONCATENATE($B37,\"-\",U$1),'База выдачи'!$A:$F,5,0)),\"\",VLOOKUP(CONCATENATE($B37,\"-\",U$1),'База выдачи'!$A:$F,5,0)),VLOOKUP(CONCATENATE($B37,\"-\",U$1),База!$A:$G,5,0))","v":""},{"$f":"IF(ISERROR(VLOOKUP(CONCATENATE($B37,\"-\",U$1),База!$A:$G,6,0)),IF(ISERROR(VLOOKUP(CONCATENATE($B37,\"-\",U$1),'База выдачи'!$A:$F,6,0)),\"\",VLOOKUP(CONCATENATE($B37,\"-\",U$1),'База выдачи'!$A:$F,6,0)),VLOOKUP(CONCATENATE($B37,\"-\",U$1),База!$A:$G,6,0))","v":""},5,{"$f":"IF(ISERROR(VLOOKUP(CONCATENATE($B37,\"-\",X$1),База!$A:$G,5,0)),IF(ISERROR(VLOOKUP(CONCATENATE($B37,\"-\",X$1),'База выдачи'!$A:$F,5,0)),\"\",VLOOKUP(CONCATENATE($B37,\"-\",X$1),'База выдачи'!$A:$F,5,0)),VLOOKUP(CONCATENATE($B37,\"-\",X$1),База!$A:$G,5,0))","v":""},{"$f":"IF(ISERROR(VLOOKUP(CONCATENATE($B37,\"-\",X$1),База!$A:$G,6,0)),IF(ISERROR(VLOOKUP(CONCATENATE($B37,\"-\",X$1),'База выдачи'!$A:$F,6,0)),\"\",VLOOKUP(CONCATENATE($B37,\"-\",X$1),'База выдачи'!$A:$F,6,0)),VLOOKUP(CONCATENATE($B37,\"-\",X$1),База!$A:$G,6,0))","v":""},9,{"$f":"IF(ISERROR(VLOOKUP(CONCATENATE($B37,\"-\",AA$1),База!$A:$G,5,0)),IF(ISERROR(VLOOKUP(CONCATENATE($B37,\"-\",AA$1),'База выдачи'!$A:$F,5,0)),\"\",VLOOKUP(CONCATENATE($B37,\"-\",AA$1),'База выдачи'!$A:$F,5,0)),VLOOKUP(CONCATENATE($B37,\"-\",AA$1),База!$A:$G,5,0))","v":""},{"$f":"IF(ISERROR(VLOOKUP(CONCATENATE($B37,\"-\",AA$1),База!$A:$G,6,0)),IF(ISERROR(VLOOKUP(CONCATENATE($B37,\"-\",AA$1),'База выдачи'!$A:$F,6,0)),\"\",VLOOKUP(CONCATENATE($B37,\"-\",AA$1),'База выдачи'!$A:$F,6,0)),VLOOKUP(CONCATENATE($B37,\"-\",AA$1),База!$A:$G,6,0))","v":""},"F",{"$f":"IF(ISERROR(VLOOKUP(CONCATENATE($B37,\"-\",AD$1),База!$A:$G,5,0)),IF(ISERROR(VLOOKUP(CONCATENATE($B37,\"-\",AD$1),'База выдачи'!$A:$F,5,0)),\"\",VLOOKUP(CONCATENATE($B37,\"-\",AD$1),'База выдачи'!$A:$F,5,0)),VLOOKUP(CONCATENATE($B37,\"-\",AD$1),База!$A:$G,5,0))","v":""},{"$f":"IF(ISERROR(VLOOKUP(CONCATENATE($B37,\"-\",AD$1),База!$A:$G,6,0)),IF(ISERROR(VLOOKUP(CONCATENATE($B37,\"-\",AD$1),'База выдачи'!$A:$F,6,0)),\"\",VLOOKUP(CONCATENATE($B37,\"-\",AD$1),'База выдачи'!$A:$F,6,0)),VLOOKUP(CONCATENATE($B37,\"-\",AD$1),База!$A:$G,6,0))","v":""},"G",{"$f":"IF(ISERROR(VLOOKUP(CONCATENATE($B37,\"-\",AG$1),База!$A:$G,5,0)),IF(ISERROR(VLOOKUP(CONCATENATE($B37,\"-\",AG$1),'База выдачи'!$A:$F,5,0)),\"\",VLOOKUP(CONCATENATE($B37,\"-\",AG$1),'База выдачи'!$A:$F,5,0)),VLOOKUP(CONCATENATE($B37,\"-\",AG$1),База!$A:$G,5,0))","v":""},{"$f":"IF(ISERROR(VLOOKUP(CONCATENATE($B37,\"-\",AG$1),База!$A:$G,6,0)),IF(ISERROR(VLOOKUP(CONCATENATE($B37,\"-\",AG$1),'База выдачи'!$A:$F,6,0)),\"\",VLOOKUP(CONCATENATE($B37,\"-\",AG$1),'База выдачи'!$A:$F,6,0)),VLOOKUP(CONCATENATE($B37,\"-\",AG$1),База!$A:$G,6,0))","v":""},"H",{"$f":"IF(ISERROR(VLOOKUP(CONCATENATE($B37,\"-\",AJ$1),База!$A:$G,5,0)),IF(ISERROR(VLOOKUP(CONCATENATE($B37,\"-\",AJ$1),'База выдачи'!$A:$F,5,0)),\"\",VLOOKUP(CONCATENATE($B37,\"-\",AJ$1),'База выдачи'!$A:$F,5,0)),VLOOKUP(CONCATENATE($B37,\"-\",AJ$1),База!$A:$G,5,0))","v":""},{"$f":"IF(ISERROR(VLOOKUP(CONCATENATE($B37,\"-\",AJ$1),База!$A:$G,6,0)),IF(ISERROR(VLOOKUP(CONCATENATE($B37,\"-\",AJ$1),'База выдачи'!$A:$F,6,0)),\"\",VLOOKUP(CONCATENATE($B37,\"-\",AJ$1),'База выдачи'!$A:$F,6,0)),VLOOKUP(CONCATENATE($B37,\"-\",AJ$1),База!$A:$G,6,0))","v":""},"I",{"$f":"IF(ISERROR(VLOOKUP(CONCATENATE($B37,\"-\",AM$1),База!$A:$G,5,0)),IF(ISERROR(VLOOKUP(CONCATENATE($B37,\"-\",AM$1),'База выдачи'!$A:$F,5,0)),\"\",VLOOKUP(CONCATENATE($B37,\"-\",AM$1),'База выдачи'!$A:$F,5,0)),VLOOKUP(CONCATENATE($B37,\"-\",AM$1),База!$A:$G,5,0))","v":""},{"$f":"IF(ISERROR(VLOOKUP(CONCATENATE($B37,\"-\",AM$1),База!$A:$G,6,0)),IF(ISERROR(VLOOKUP(CONCATENATE($B37,\"-\",AM$1),'База выдачи'!$A:$F,6,0)),\"\",VLOOKUP(CONCATENATE($B37,\"-\",AM$1),'База выдачи'!$A:$F,6,0)),VLOOKUP(CONCATENATE($B37,\"-\",AM$1),База!$A:$G,6,0))","v":""},"J",{"$f":"IF(ISERROR(VLOOKUP(CONCATENATE($B37,\"-\",AP$1),База!$A:$G,5,0)),IF(ISERROR(VLOOKUP(CONCATENATE($B37,\"-\",AP$1),'База выдачи'!$A:$F,5,0)),\"\",VLOOKUP(CONCATENATE($B37,\"-\",AP$1),'База выдачи'!$A:$F,5,0)),VLOOKUP(CONCATENATE($B37,\"-\",AP$1),База!$A:$G,5,0))","v":""},{"$f":"IF(ISERROR(VLOOKUP(CONCATENATE($B37,\"-\",AP$1),База!$A:$G,6,0)),IF(ISERROR(VLOOKUP(CONCATENATE($B37,\"-\",AP$1),'База выдачи'!$A:$F,6,0)),\"\",VLOOKUP(CONCATENATE($B37,\"-\",AP$1),'База выдачи'!$A:$F,6,0)),VLOOKUP(CONCATENATE($B37,\"-\",AP$1),База!$A:$G,6,0))","v":""},"K",{"$f":"IF(ISERROR(VLOOKUP(CONCATENATE($B37,\"-\",AS$1),База!$A:$G,5,0)),IF(ISERROR(VLOOKUP(CONCATENATE($B37,\"-\",AS$1),'База выдачи'!$A:$F,5,0)),\"\",VLOOKUP(CONCATENATE($B37,\"-\",AS$1),'База выдачи'!$A:$F,5,0)),VLOOKUP(CONCATENATE($B37,\"-\",AS$1),База!$A:$G,5,0))","v":""},{"$f":"IF(ISERROR(VLOOKUP(CONCATENATE($B37,\"-\",AS$1),База!$A:$G,6,0)),IF(ISERROR(VLOOKUP(CONCATENATE($B37,\"-\",AS$1),'База выдачи'!$A:$F,6,0)),\"\",VLOOKUP(CONCATENATE($B37,\"-\",AS$1),'База выдачи'!$A:$F,6,0)),VLOOKUP(CONCATENATE($B37,\"-\",AS$1),База!$A:$G,6,0))","v":""},null,null,{"$f":"COUNTIFS(База!B:B,Статистика!B37,База!E:E,\"OK\")","v":0},{"$f":"DW3","v":"03:03:16.770"},10997,{"$f":"COUNTIFS(База!B:B,Статистика!B37,База!E:E,\"XXXX\")","v":0},{"$f":"IF(AX37+AZ37+BA37=0,ксекундвигре-BD37,ксекундвигре*Статистика!AX37+(ксекундвигре-Статистика!AZ37)+Статистика!BA37)","v":-137},-137,35,31]

{"sheet":"Хелп","index":7,"n_rows":7,"n_cols":3,"rows_kept":7}
["№","Ситуация","Действия Ди2"]
[0,"Общий старт","Нажать на кнопку СТАРТ."]
[1,"код правильный","Выбрать команду. Проверить код. Нажать на кнопку 1."]
[2,"код неправильный","Выбрать команду. Проверить код. Нажать кнопочку 2."]
[3,"Ранний отказ","Выбрать команду. Проверить время. Нажать кнопочку 2."]
[4,"Пересечение команд на одном задании","Выбрать команду. Ввести код следующего задания вручную. Нажать на кнопку 1."]
[5,"Своевременный отказ","Выбрать команду. Проверить время. Нажать кнопку 1."]